news 2026/11/4 9:37:21

APB/AXI异步桥设计与实现:从脉冲同步到双向握手的实战解析

作者头像

张小明

前端开发工程师

1.2k 24
文章封面图
APB/AXI异步桥设计与实现:从脉冲同步到双向握手的实战解析

1. 异步桥:为什么你的芯片设计需要它?

如果你做过芯片设计,尤其是SoC(片上系统)集成,肯定遇到过这样的头疼事:系统里好几个模块,各自跑在不同的时钟频率下。比如,一个慢悠悠的、负责配置寄存器的APB总线,和一个高速运转、负责大数据搬运的AXI总线,它们俩怎么安全地“对话”?直接连起来?那肯定不行,时钟不同步,数据传过去大概率是错的,轻则功能异常,重则整个系统死锁。这时候,你就需要一个“翻译官”兼“协调员”——异步桥。

异步桥,顾名思义,就是专门处理跨时钟域(Clock Domain Crossing, CDC)数据传输的桥梁电路。它的核心任务不是改变数据内容,而是确保数据能安全、正确地从源时钟域“搬运”到目标时钟域,同时处理好两边节奏不一致带来的所有潜在风险。想象一下,就像两个转速不同的齿轮,直接咬合会打齿崩坏,中间加一套离合器(异步桥)来匹配转速,动力才能平稳传递。

在APB、AXI这类总线互联中,异步桥更是不可或缺。APB总线简单,但它的传输协议(PSEL、PENABLE、PREADY握手)是典型的电平敏感型,跨越时钟域时,一个没处理好,就会漏发或者重复发起传输。AXI总线更复杂,它有五条独立的通道(读地址、读数据、写地址、写数据、写响应),每条通道都有自己的一套握手信号(VALID/READY),跨时钟域问题呈指数级增长。自己从头设计一个稳定可靠的异步桥?我试过,踩过的坑能写满好几页纸。所以,今天我就结合自己多年的实战经验,带你从最基础的同步电路开始,一直深入到APB/AXI异步桥的具体实现,特别是那些容易出错的细节和不同方案的取舍。我们的目标就一个:让你不仅能看懂,更能自己动手实现一个“稳如老狗”的异步桥。

2. 跨时钟域同步的基石:从脉冲到电平

在搭建高楼(异步桥)之前,得先打好地基。跨时钟域同步有几种经典的基础电路,它们是所有复杂异步桥的构建模块。理解它们的原理和局限,是后续设计不翻车的关键。

2.1 电平同步器:最简单的“缓冲器”

这是你最先会想到,也最容易出错的方案。它的结构很简单,就是目标时钟域里用两级(或更多)触发器(Flip-Flop)对源时钟域的信号进行打拍。

module level_sync ( input wire src_clk, input wire src_signal, input wire dst_clk, output reg dst_signal_synced ); reg [1:0] sync_ff; always @(posedge dst_clk) begin sync_ff <= {sync_ff[0], src_signal}; end assign dst_signal_synced = sync_ff[1]; endmodule

它的工作原理:假设src_signal是一个从慢时钟域发出的、宽度超过快时钟域周期的电平信号。经过两级触发器同步后,dst_signal_synced会延迟两个目标时钟周期出现,但最终能稳定地反映出源信号的电平变化。

坑在哪里?它只能同步电平信号,而且这个电平的宽度必须足够宽,确保能被目标时钟采样到。如果源信号是个窄脉冲(宽度小于目标时钟周期),这个脉冲很可能在两级触发器之间“滑过去”,导致目标域根本看不到这个事件。所以,电平同步器常用于同步复位信号、稳定的配置使能等变化不频繁的宽电平信号。想用它来同步总线传输中的请求脉冲?门儿都没有。

2.2 脉冲同步器:捕捉“瞬间”的艺术

既然电平同步器抓不住脉冲,那我们就专门为脉冲设计一个方案。核心思想是:先把脉冲变成目标时钟域能稳定捕捉的电平,同步过去之后,再把这个电平恢复成脉冲。这是一个“展宽-同步-还原”的过程。

第一步:脉冲展电平(在源时钟域)当检测到输入脉冲pulse_in时,置位一个触发器,产生一个电平信号level。

// 在 src_clk 域 reg level; always @(posedge src_clk or posedge rst) begin if (rst) level <= 1'b0; else if (pulse_in) level <= 1'b1; // 脉冲到来,电平拉高 else if (level_ack_synced) level <= 1'b0; // 收到确认,电平拉低 end

第二步:电平同步(跨时钟域)将level信号用前面提到的两级触发器同步到目标时钟域,得到level_synced。

第三步:电平恢复脉冲(在目标时钟域)在目标时钟域,检测level_synced的上升沿(即电平从0变1的时刻),产生一个单周期的目标域脉冲pulse_out。同时,为了通知源域“脉冲已处理”,通常还需要生成一个反馈确认信号level_ack,将其同步回源时钟域(level_ack_synced),用于清除源域的level信号。

// 在 dst_clk 域 reg level_synced_ff; wire pulse_out; always @(posedge dst_clk) level_synced_ff <= level_synced; assign pulse_out = level_synced & ~level_synced_ff; // 边沿检测 reg level_ack; always @(posedge dst_clk or posedge rst) begin if (rst) level_ack <= 1'b0; else level_ack <= pulse_out; // 产生确认信号 end // 再将 level_ack 同步回 src_clk 域...

实测下来很稳,但代价是延迟。从源脉冲发出,到目标脉冲产生,至少需要“展宽+同步+边沿检测”的时间,通常大于3个目标时钟周期。而且它一次只能处理一个未完成的脉冲,如果前一个脉冲还没被确认,第二个脉冲就来了,会被丢失。所以它适合低频、非连续的脉冲同步场景。

2.3 异步FIFO:大数据流的“高速公路”

当需要同步的不是单个信号,而是一整组、多比特的数据总线时(比如32位数据+4位控制信号),上面两种方法就彻底失效了。你不能把36根线分别做脉冲同步,因为它们到达目标域的时间可能错开,导致采样到完全错误的数据组合(这就是所谓的“亚稳态传播”和“数据歪斜”)。

这时就必须请出异步FIFO。你可以把它想象成一个跨时钟域的“邮箱”。发送方(写时钟域)把数据包“投递”到邮箱的写入口,接收方(读时钟域)从邮箱的读出口“取走”数据包。邮箱内部有读写指针和状态判断逻辑,通过格雷码(Gray Code)同步这些指针来安全地判断空满状态,完美地隔离了两个时钟域。

异步FIFO的实现是一个大话题,涉及格雷码转换、指针比较、空满标志生成等。它的优点是能处理连续的数据流,吞吐量高,是AXI总线异步桥的标配。缺点是电路面积和功耗相对较大,对于APB这种低速、非流水的总线,有时显得“杀鸡用牛刀”。

2.4 DMUX同步/限定符同步:精准控制的“选通门”

这是介于脉冲同步和异步FIFO之间的一种优雅方案,特别适合控制信号与数据信号一同传递的场景。其核心思想是:先同步一个“选通”或“限定”信号(Qualifier),再用这个同步后的安全信号,去锁存或选通与之关联的多比特数据。

举个例子,源时钟域有一组数据data[31:0]和一个有效的脉冲信号data_valid。我们不能直接同步data[31:0],但我们可以同步data_valid这个单比特信号(比如用脉冲同步器)。当同步后的data_valid_synced在目标时钟域拉高时,就意味着此时在目标时钟域采样到的data[31:0]是稳定且有效的。我们只需要在目标域用触发器在data_valid_synced有效的时钟沿锁存这组数据即可。

// 在 dst_clk 域 reg [31:0] data_synced; always @(posedge dst_clk) begin if (data_valid_synced) begin // 只有安全的选通信号有效时才采样数据 data_synced <= data; // 此处的 data 来自 src_clk 域,但采样时刻是安全的 end end

这种方法的关键在于,数据和选通信号必须满足一定的时序关系。通常要求数据(data)在选通信号(data_valid)有效之前就已经建立稳定,并在选通信号无效后保持一段时间。这样,选通信号同步过程中产生的延迟,不会影响到它最终采样数据时的正确性。APB异步桥中广泛使用的就是这种思想的变种。

3. APB异步桥实战:三种实现策略深度拆解

APB协议相对简单,一次传输由两个阶段组成:Setup阶段(PSEL=1, PENABLE=0)和Access阶段(PSEL=1, PENABLE=1),以PREADY响应结束。实现APB异步桥,本质就是要安全地同步PSEL、PENABLE和PREADY这几个握手信号,并确保与它们关联的地址、写数据、读数据能正确传递。

3.1 方案一:异步FIFO直通

这是最“暴力”也最直观的思路。把APB的整个传输事务(包括地址、控制、数据)打包,通过一个异步FIFO从从端(Slave)时钟域发送到主端(Master)时钟域。反向的响应数据也同样通过一个FIFO传回。

  • 优点:逻辑清晰,隔离彻底,对两边的时钟频率比几乎没有要求,即使一边时钟长时间停滞也不影响另一边(只要FIFO不溢出)。
  • 缺点:资源消耗最大。APB一次传输虽然数据量小,但控制信号也需要存储。而且引入了至少两个FIFO的延迟,对于低延迟要求的场景不友好。在实际的轻量级外设互联中,往往觉得有点“重”。

3.2 方案二:基于限定符同步的精巧握手(核心方案)

这是最常用、也最体现设计功力的方案。它避免了FIFO,采用了一种“按需同步、精准控制”的策略。我们仔细拆解一下原始资料中提到的过程,我用自己的话和代码给你捋清楚。

核心洞察:APB传输的启动,本质上是由一个脉冲触发的——那就是PSEL_S & (~PENABLE_S)。在Setup阶段开始时,PSEL拉高而PENABLE还为低,这个条件满足一个周期,产生一个启动脉冲。我们的目标就是把这个脉冲安全地同步到主时钟域。

从端到主端(Slave -> Master)流程:

  1. 生成并同步限定脉冲:在从端时钟域(clk_s),生成启动脉冲start_pulse_s = PSEL_S & (~PENABLE_S)。然后,使用一个脉冲同步器(就是2.2节讲的那种),将这个脉冲同步到主端时钟域(clk_m),得到start_pulse_m。

    // clk_s domain wire start_pulse_s = psel_s & (~penable_s); // 实例化脉冲同步器,将 start_pulse_s 同步到 clk_m,输出为 start_pulse_m pulse_sync u_sync_s2m (...);
  2. 用同步脉冲控制主端PSEL/PENABLE:start_pulse_m在主端时钟域是一个单周期脉冲。我们用这个脉冲来置位主端的PSEL_M。

    // clk_m domain always @(posedge clk_m or posedge rst_m) begin if (rst_m) psel_m <= 1'b0; else if (start_pulse_m) psel_m <= 1'b1; // 脉冲到来,启动传输 else if (psel_m & penable_m & pready_m) psel_m <= 1'b0; // 传输完成,结束 end

    同理,可以用start_pulse_m打一拍产生penable_m的置位信号,并用完成条件清零。更常见的做法是,当PSEL_M拉高后,下一个周期自动拉高PENABLE_M。

  3. 安全传递地址/控制/写数据:这是DMUX同步的典型应用。start_pulse_m或其衍生的PSEL_M信号,就是一个完美的、已同步的“选通”信号。当它有效时,主时钟域采样到的从端信号PADDR_S,PWRITE_S,PWDATA_S就是稳定的。我们可以直接赋值,或者用PSEL_M作为多路选择器的控制端:

    assign paddr_m = (psel_m) ? paddr_s : 'b0; assign pwrite_m = (psel_m) ? pwrite_s : 1'b0; assign pwdata_m = (psel_m) ? pwdata_s : 'b0;

    注意,这里paddr_s等信号是直接来自另一个时钟域的,但因为我们只在psel_m(已同步)有效时才采样/使用它们,所以是安全的。

主端到从端(Master -> Slave)流程:

  1. 生成并同步完成脉冲:在主端时钟域,传输完成的标志是PSEL_M & PENABLE_M & PREADY_M。这同样是一个脉冲。我们把它同步回从端时钟域,作为从端的PREADY_S。

    // clk_m domain wire complete_pulse_m = psel_m & penable_m & pready_m; // 实例化脉冲同步器,将 complete_pulse_m 同步到 clk_s,输出为 pready_s pulse_sync u_sync_m2s (...);
  2. 锁存并传递读数据/错误信号:同样是DMUX思想。在传输完成的那个周期(complete_pulse_m有效),主端的读数据PRDATA_M和错误信号PSLVERR_M是有效的。我们用触发器在此时将它们锁存下来。

    // clk_m domain reg [31:0] prdata_latched; reg pslverr_latched; always @(posedge clk_m) begin if (complete_pulse_m) begin prdata_latched <= prdata_m; pslverr_latched <= pslverr_m; end end

    锁存后的prdata_latched和pslverr_latched已经是稳定的电平信号,可以直接连接到从端的PRDATA_S和PSLVERR_S上,因为它们的变化只发生在complete_pulse_m时刻,而这个时刻对应的数据已经被安全捕获。从端时钟域在收到同步回来的PREADY_S时,直接读取这两个信号即可。

这个方案的精妙之处在于,它通过两个方向的脉冲同步器,构建了两个“握手”通道。正向通道(S->M)用启动脉冲同步来发起事务,反向通道(M->S)用完成脉冲同步来结束事务。数据传递则巧妙地利用了已同步的控制信号作为安全选通,完全避免了多比特直接同步。实测下来,这种方案资源占用小,延迟可控,是APB异步桥的主流选择。

3.3 方案三:基于双向握手的强同步

方案二在大多数情况下工作良好,但它隐含了一个假设:前一次传输的完成脉冲返回之前,从端不会发起下一次传输(即APB协议本身是如此的)。但在某些极端异步情况下,或者为了设计上更严格的鲁棒性,我们可以采用更显式的双向握手协议。

这种方案需要两对握手信号:REQ(请求)和ACK(应答)。

  1. 在从端时钟域,当PSEL_S & (~PENABLE_S)时,拉高REQ_S。
  2. 将REQ_S同步到主端时钟域(通常用电平同步器),得到REQ_S2M。主端看到REQ_S2M为高,则发起APB传输(拉高PSEL_M)。
  3. 主端传输完成后(PREADY_M),拉高ACK_M。
  4. 将ACK_M同步回从端时钟域,得到ACK_S。从端看到ACK_S为高,则清除REQ_S,并结束本次传输(拉高自身的PREADY_S)。
  5. 主端还需要监测REQ_S2M的下降沿(意味着从端已收到ACK),以确保一次握手循环彻底完成,才能准备下一次传输。
// 概念性代码,展示握手流程 // clk_s domain always @(posedge clk_s) begin if (apb_start_condition) req_s <= 1'b1; else if (ack_s_synced) req_s <= 1'b0; // 收到应答才撤销请求 end // clk_m domain always @(posedge clk_m) begin // 检测到同步过来的请求 if (req_synced && !psel_m) begin // 发起APB传输 psel_m <= 1'b1; end // APB传输完成 if (psel_m & penable_m & pready_m) begin ack_m <= 1'b1; // 发出应答 end if (!req_synced) begin // 请求撤销,握手完成 ack_m <= 1'b0; // 可以准备下一次传输 end end

这种方案的优点是同步过程非常稳固,对两个时钟域的相对速度几乎没有限制,抗干扰能力强。缺点是握手环节多,延迟比方案二更大。它通常用在可靠性要求极高,或时钟关系非常复杂的场景中。

4. 从APB到AXI:异步桥设计的复杂化

把APB异步桥搞明白后,再看AXI异步桥,你会发现核心思想是相通的,但复杂度不是一个量级。AXI的挑战主要来自以下几点:

  1. 多通道独立握手:AXI有5个通道,每个通道的VALID/READY握手都是独立的。这意味着你需要为每个通道都实现一套独立的CDC同步机制。读数据通道和写响应通道的方向还是从下游到上游,与地址/写数据通道相反。
  2. 乱序与交织:AXI支持乱序完成和ID交织。这意味着读数据或写响应返回的顺序可能与请求发出的顺序不同。异步桥不仅要同步数据,还要同步和管理每个事务的ID,确保响应能正确匹配到请求。这通常需要在桥内部实现一个乱序缓冲区(OOO Buffer)或标签跟踪逻辑。
  3. 数据流与反压:AXI是高带宽流水线。写数据通道可能有多个数据beat在传输中,READY信号的反压需要跨时钟域正确传递,否则会导致数据丢失或死锁。这常常需要用到异步FIFO来缓冲数据beat。
  4. 性能要求:AXI通常用于高性能数据通路,对吞吐量和延迟敏感。异步桥的设计不能成为性能瓶颈。

因此,一个完整的AXI异步桥,其内部结构往往是多种同步技术的混合体:

  • 地址通道和控制通道:可能采用类似APB方案二的限定符同步或双向握手。因为地址和控制信息量相对固定,且一次事务只发生一次。
  • 写数据通道:几乎一定会使用异步FIFO。因为数据beat是流式的,且数量可变,FIFO能很好地缓冲数据并传递反压。
  • 读数据通道和写响应通道:同样会使用异步FIFO,用于将返回的数据和响应从从时钟域传递到主时钟域,并处理可能的乱序。
  • ID管理逻辑:在桥内部维护一个表,记录发出的每个请求的ID及其状态,当响应返回时进行匹配。这部分逻辑的CDC处理需要格外小心。

所以,当你需要设计一个AXI异步桥时,很少会从头写起。通常会使用IP核,或者参考业界成熟的开源实现(比如基于SystemVerilog/UVM的验证IP中的桥接组件)。但理解其内部的CDC原理,对于配置、集成和调试这些IP至关重要。你会知道为什么需要配置FIFO深度,什么时候选择握手模式而不是FIFO模式,以及如何分析跨时钟域的时序路径。

5. 实战中的坑与最佳实践

纸上得来终觉浅,绝知此事要躬行。最后,分享几个我在实际项目中踩过的坑和总结的经验,希望能帮你少走弯路。

坑一:同步器级数不够。早期为了省面积,只用一级触发器做同步,结果在芯片测试中偶尔出现无法复现的诡异错误。在深亚微米工艺下,亚稳态恢复时间可能很长,两级同步是最低要求,对高可靠性设计或高频时钟,三级同步更保险。这点面积不能省。

坑二:忽略了时钟门控的影响。如果源或目标时钟可能被门控(gated),同步器的输入端可能会在时钟无效时变化,而当时钟重新有效时,亚稳态风险极高。确保同步器的输入信号在目标时钟有效沿附近是稳定的,或者使用带门控时钟意识的同步器单元。

坑三:复位信号的CDC处理不当。这是最常见的死锁原因。如果两个时钟域的复位信号不是异步复位且同步释放,很可能导致一边模块在工作,另一边还在复位状态,握手永远无法完成。务必使用复位同步器来处理跨时钟域的复位撤销。

最佳实践一:完备的CDC验证。RTL代码写完后,必须用专门的CDC验证工具(如Spyglass CDC、JasperGold)跑一遍。它能检查出单比特同步、多比特同步、复位同步、握手协议中的所有潜在问题,比如数据丢失、脉冲重叠、死锁等。静态检查比仿真更容易发现极端情况下的问题。

最佳实践二:清晰的代码注释与模块划分。将同步器(如两级触发器)、脉冲同步模块、握手协议模块等封装成独立的、经过验证的子模块。在顶层桥接逻辑中实例化它们,并清晰注释每个信号的时钟域归属(// clk_s domain,// clk_m domain)。这极大提升了代码的可读性和可维护性。

最佳实践三:仿真时注入时钟抖动与偏移。在验证环境中,不要只使用理想的同源时钟。尝试让两个时钟的频率有微小差异(比如100MHz和99.9MHz),或者加入随机的相位偏移和抖动。这能更好地模拟真实芯片中时钟网络的差异,暴露出更多潜在问题。

异步桥的设计,是数字逻辑工程师从“功能正确”走向“物理可靠”的关键一步。它没有太多高深的算法,却充满了对时序、电路稳定性和系统可靠性的深刻理解。希望这篇从脉冲同步到双向握手的实战解析,能帮你建立起清晰的设计脉络。下次当你需要在芯片里连接两个不同节奏的模块时,希望你能自信地选出合适的方案,搭建起那座稳固的桥梁。

版权声明: 本文来自互联网用户投稿,该文观点仅代表作者本人,不代表本站立场。本站仅提供信息存储空间服务,不拥有所有权,不承担相关法律责任。如若内容造成侵权/违法违规/事实不符,请联系邮箱:809451989@qq.com进行投诉反馈,一经查实,立即删除!
网站建设 2026/11/4 9:36:40

百川2-13B赋能微信小程序:打造个人AI聊天助手

百川2-13B赋能微信小程序&#xff1a;打造个人AI聊天助手 最近在捣鼓一些AI应用&#xff0c;发现很多朋友都想有个自己的聊天机器人&#xff0c;能随时聊聊天、问问问题。但直接用网页或者App总觉得不够方便&#xff0c;要是能集成在微信小程序里&#xff0c;点开就用&#xf…

作者头像 李华
网站建设 2026/11/4 9:36:40

OpenCV 结合 Tesseract 实现高效字符识别

1. 从“看见”到“读懂”&#xff1a;为什么需要OpenCVTesseract组合拳&#xff1f; 你有没有遇到过这样的场景&#xff1f;拍了一张发票照片&#xff0c;想快速把上面的金额和编号录入电脑&#xff0c;结果只能一个字一个字地敲&#xff1b;或者&#xff0c;想从一堆扫描的PDF…

作者头像 李华
网站建设 2026/10/3 23:57:55

JetBrains IDE试用期管理工具:从限制突破到合规使用全指南

JetBrains IDE试用期管理工具&#xff1a;从限制突破到合规使用全指南 【免费下载链接】ide-eval-resetter 项目地址: https://gitcode.com/gh_mirrors/id/ide-eval-resetter 1. 开发痛点诊断&#xff1a;当IDE试用期结束时的真实困境 想象一下这样的场景&#xff1a;…

作者头像 李华
网站建设 2026/10/4 23:23:19

Python脚本自动化更新Arcgis属性表字段值:以国土空间分类标准调整为例

1. 为什么你需要这个脚本&#xff1f;从手动改到自动化的蜕变 如果你在国土、规划、测绘或者相关领域工作&#xff0c;最近可能被一个事情搞得焦头烂额&#xff1a;新的《国土空间调查、规划、用途管制用地用海分类说明》发布了&#xff0c;这意味着你手头大量的三调数据、规划…

作者头像 李华
网站建设 2026/10/4 23:23:56

LeagueAkari:重构游戏决策体验的本地英雄联盟辅助工具

LeagueAkari&#xff1a;重构游戏决策体验的本地英雄联盟辅助工具 【免费下载链接】LeagueAkari ✨兴趣使然的&#xff0c;功能全面的英雄联盟工具集。支持战绩查询、自动秒选等功能。基于 LCU API。 项目地址: https://gitcode.com/gh_mirrors/le/LeagueAkari 价值定位…

作者头像 李华
网站建设 2026/10/4 23:24:30

MedGemma X-Ray实战效果:对话式影像分析,提问即得专业答案

MedGemma X-Ray实战效果&#xff1a;对话式影像分析&#xff0c;提问即得专业答案 想象一下这样的场景&#xff1a;一位医学生面对一张复杂的胸部X光片&#xff0c;不知道从哪里开始观察&#xff1b;一位基层医生在夜班时遇到不典型的影像表现&#xff0c;需要快速参考意见&am…

作者头像 李华