news 2026/10/17 15:31:42

EquivSVA:基于形式化验证的行为等价性断言方法

作者头像

张小明

前端开发工程师

1.2k 24
文章封面图
EquivSVA:基于形式化验证的行为等价性断言方法

1. 这不是又一个“测试用例集”:EquivSVA 的本质是形式化验证的“语义锚点”

你有没有遇到过这样的场景:两个 RTL 模块,功能完全等价——比如一个用组合逻辑实现的加法器,另一个用流水线结构重写,综合后门级网表一致,仿真波形也一模一样。但当你把它们分别集成进更大的系统里,其中一个突然在某个 corner 下出现亚稳态传播,而另一个却稳如泰山?问题出在哪?不是功能不对,而是行为语义的表达边界模糊了。EquivSVA 就是在这个裂缝上打下的一根钢钉。它不是一个传统意义上的“测试数据集”,而是一套经过数学证明、可被形式化验证工具直接消费的Behavioral Assertions(行为断言)集合,专门用来刻画“等价 RTL 实现之间必须共享的、不可妥协的行为契约”。

关键词里没有写出来,但标题里的EquivSVA三个字母已经说清了一切:Equiv是 equivalence(等价性),SVA是 SystemVerilog Assertions(SystemVerilog 断言)。它不关心 RTL 代码怎么写,只关心“当输入满足 A 条件时,输出必须在 B 周期内呈现 C 状态,并且中间不能出现 D 类非法状态”这类刚性约束。而“Formally Verified”意味着每一条断言都不是靠人拍脑袋写的,而是通过定理证明器(比如 SMT Solver 或 Coq)验证过:只要两个 RTL 实现都满足这组断言,它们在所有可能的输入序列和时序条件下,对外表现出的行为就是严格等价的。这不是覆盖率报告里那个“98% 覆盖了”,这是 100% 数学意义上的“无例外”。

我第一次在 DAC 2023 的 poster session 看到这个项目时,第一反应是:“这东西能落地吗?”——因为过去十年,我们团队写过上千条 SVA,但几乎全是针对单个模块的“安全护栏”:复位释放后信号不能 glitch、FIFO 满时不能再写、状态机不能跳进非法状态……这些断言管的是“别出错”。而 EquivSVA 管的是“必须一样”。它要求你把模块的行为契约从隐含的文档、口头约定、甚至仿真波形里,提炼成可证伪、可验证、可复用的逻辑公式。这背后需要的不是更多 testbench,而是对模块接口协议、时序约束、异常路径的深度建模能力。它解决的不是“能不能跑”,而是“换了一种写法之后,它还‘是它自己’吗?”这个问题。所以,如果你正在做 IP 复用、RTL 重构、低功耗改造(比如插入 clock gating)、或者 DFT 插入(你提到的“dft插复位怎么改rtl”),EquivSVA 就是你手里的那把游标卡尺——它不告诉你新 RTL 多快,但它能 100% 确认:新 RTL 和旧 RTL,在行为层面,分毫不差。

2. 为什么“等价性”不能只靠仿真?——形式化验证的不可替代性

很多人会问:既然两个 RTL 仿真结果一致,不就说明它们等价吗?这个直觉很危险。让我用一个真实踩过的坑来说明。去年我们有个 legacy UART IP,原始版本用纯组合逻辑实现波特率发生器,后来为了降低功耗,工程师用一个带使能的计数器重写了它。仿真跑了 10 万帧数据,全 pass。但在芯片回片后的高温测试中,新版本在特定 baud rate 下出现了间歇性丢帧。Root cause 是:新计数器在使能信号跳变边沿存在微小的 setup/hold violation 风险,而旧版组合逻辑天然免疫。仿真没抓到,是因为 testbench 里使能信号的跳变时刻是理想化的;而真实硅片上,PVT 变化放大了这个窗口。

这就是仿真的根本局限:它只能验证你想到的那些输入序列,永远无法穷尽所有可能的时序组合、所有 corner 下的延迟变化、所有异步信号的相位关系。而形式化验证(Formal Verification)不同。它把 RTL 当作一个状态机,把断言当作一个必须在整个状态空间中恒为真的属性(property)。验证器会自动探索所有可能的状态转移路径,寻找是否存在任何一条路径,使得断言被违反。如果找不到,就数学证明该断言成立;如果找到,就给出一个反例(counterexample)——一个具体的输入序列和初始状态,精确复现问题。

EquivSVA 正是建立在这个基础上。它不验证“这个模块功能正确”,而是验证“这两个模块的行为轨迹在数学上完全重合”。具体怎么做?核心思想是Cross-Property Verification(跨属性验证):

  1. 把两个等价的 RTL 实现(A 和 B)并排放置,共享同一组输入激励;
  2. 在它们的对应输出端口之间,插入一组 EquivSVA 断言,例如assert property (@(posedge clk) (A.out == B.out));;
  3. 更关键的是,它还会在内部关键节点(比如状态寄存器、握手信号)之间插入断言,确保不仅最终输出一致,中间的“行为轨迹”也一致;
  4. 形式化验证工具会尝试证明:对于所有可能的输入序列和所有可能的初始状态,A 和 B 的输出序列完全相同。

这比单纯比对最终输出强大得多。它能捕捉到“输出相同但内部状态演化路径不同”的隐患——而这恰恰是很多时序相关 bug 的温床。所以,EquivSVA 不是替代仿真,而是给仿真装上一副“显微镜”和“X 光机”。它回答的问题是:“在所有物理世界可能发生的情况下,这两个设计是否真的、绝对地、数学意义上地,表现得一模一样?”答案,只有形式化验证能给。

3. EquivSVA 断言长什么样?——从抽象契约到 SystemVerilog 代码的翻译过程

看到“Formally Verified Dataset”,你可能会想象一堆晦涩的 Coq 代码或 SMT-LIB 表达式。但 EquivSVA 的精妙之处在于,它的最终交付物是标准的、可直接在主流 EDA 工具(如 Cadence JasperGold, Synopsys VC Formal)中运行的 SystemVerilog Assertion(SVA)代码。这意味着,你不需要成为形式化验证专家,也能用上它。关键在于理解这层“翻译”是如何完成的。

我们以一个最简单的例子切入:一个 2-to-1 多路选择器(MUX)。原始 RTL 是assign out = sel ? a : b;。等价实现可能是用三态门加一个 OR 门:assign out = (sel & a) | (~sel & b);。它们功能等价,但结构不同。EquivSVA 会为它生成什么断言?

最基础的当然是输出等价:

// EquivSVA_Mux_Out_Equal.sv property p_out_equal; @(posedge clk) (mux_a.out === mux_b.out); endproperty assert property (p_out_equal) else $error("MUX outputs differ!");

但这远远不够。真正的行为等价,还包含对时序响应的约束。比如,假设 MUX 的sel是异步控制信号,那么out的变化必须在sel变化后的第一个clk上升沿之后才发生(即同步更新)。EquivSVA 会强制规定这个时序契约:

// EquivSVA_Mux_Timing_Contract.sv // 约束:sel 变化后,out 必须在下一个 clk 上升沿更新,且不能提前 property p_sel_to_out_timing; @(posedge clk) disable iff (!rst_n) ($changed(sel) |=> ##1 $stable(out)) ##0 (out == (sel ? a : b)); endproperty assert property (p_sel_to_out_timing) else $error("MUX timing contract violated!");

这里就用到了你提到的SystemVerilog 的 bind 语法。因为断言不能直接写在 RTL 代码里(会污染设计),EquivSVA 的标准实践是:将所有断言写在独立的.sv文件中,然后用bind将其“挂载”到目标模块实例上:

// top_tb.sv module top_tb; // 实例化两个等价的 MUX mux #(.WIDTH(8)) uut_a (.clk(clk), .rst_n(rst_n), .sel(sel_a), .a(a), .b(b), .out(out_a)); mux #(.WIDTH(8)) uut_b (.clk(clk), .rst_n(rst_n), .sel(sel_b), .a(a), .b(b), .out(out_b)); // 使用 bind 将 EquivSVA 断言绑定到两个实例 bind uut_a equiv_sva_mux_checker #(.INSTANCE_NAME("a")) checker_a (.clk(clk), .rst_n(rst_n), .sel(sel_a), .a(a), .b(b), .out(out_a)); bind uut_b equiv_sva_mux_checker #(.INSTANCE_NAME("b")) checker_b (.clk(clk), .rst_n(rst_n), .sel(sel_b), .a(a), .b(b), .out(out_b)); endmodule

bind语法在这里扮演了“外科手术刀”的角色:它精准地将验证逻辑注入到设计的指定位置,而不修改一行 RTL 代码。这也是 EquivSVA 能被快速集成到现有流程中的关键。更复杂的断言,比如涉及SystemVerilog 队列(queue)的 FIFO 行为等价(队列长度、满/空标志、读写指针关系),会使用$past、$stable、$rose等内置系统函数,以及first_match、throughout等序列操作符,构建出能描述“数据流生命周期”的复杂属性。每一条这样的断言,背后都有一个形式化证明,确保它所刻画的契约,是两个等价 RTL 实现必然共享的最小公分母。

4. 如何构建你自己的 EquivSVA?——从需求分析到断言生成的四步工作流

EquivSVA 项目本身提供了一个开源的数据集,但你的项目不可能总能找到现成的。真正有价值的是掌握构建方法论。根据我们团队在三个大型 SoC 项目中的实践,构建一套可靠的 EquivSVA,必须遵循一个严谨的四步闭环工作流,缺一不可。跳过任何一步,都会让断言变成“形式化的装饰品”,而非“行为的守护者”。

4.1 第一步:接口与协议的“原子化”拆解(不是写代码,是画图)

这一步最容易被跳过,却是最关键的。不要急着打开编辑器。拿出白板,把你要验证的模块(比如一个 AMBA APB Slave)的接口信号,按功能彻底拆解:

  • 驱动侧(Master):PADDR,PWRITE,PWDATA,PRDATA,PREADY,PSLVERR
  • 被驱动侧(Slave):PCLK,PRESETn,PSEL,PENABLE,PREADY,PSLVERR

然后,针对每一个信号,用自然语言+时序图,定义它的行为契约:

  • PSEL:必须在PENABLE为高之前的一个周期内拉高,且在PENABLE为高期间必须保持稳定;
  • PREADY:在PSEL && PENABLE为真时,必须在一个周期内变为高,否则进入等待状态;
  • PSLVERR:仅在PSEL && PENABLE && PREADY同时为高时,才能有效指示错误。

这个过程,本质上是在把模糊的“APB 协议”翻译成模块级别的、可验证的“行为规则”。我们称之为Protocol Atomization(协议原子化)。每个原子规则,就是未来一条 SVA 的雏形。这一步的产出物,不是代码,而是一份带有时序图的 Word 文档。我坚持要求所有验证工程师先交这份文档,再写断言。因为如果契约定义错了,后面所有形式化验证都是在验证一个错误的目标。

4.2 第二步:等价性维度的“正交化”建模(区分“功能”、“时序”、“鲁棒性”)

两个 RTL 等价,绝不仅仅是“输入一样,输出一样”。EquivSVA 强制你思考三个正交维度:

  1. Functional Equivalence(功能等价):在理想时序下,对所有合法输入序列,输出序列完全相同。这是最基础的。
  2. Timing Equivalence(时序等价):在所有 PVT corner 下,关键路径的延迟、握手信号的建立/保持时间、状态转换的最小周期,都落在同一规格范围内。这需要结合 STA(Static Timing Analysis)报告来定义。
  3. Robustness Equivalence(鲁棒性等价):对非法输入(如PSEL与PENABLE时序违规)、亚稳态(如异步复位释放)、电源噪声等异常情况,两个实现的恢复行为、错误上报机制、状态机防呆策略,必须一致。

我们在做 DFT 插入时,就深刻体会到第三点的重要性。“dft插复位怎么改rtl”这个问题,表面是代码修改,实质是鲁棒性契约的变更。原始 RTL 的复位释放是异步的,DFT 版本为了可控性,改成了同步释放。EquivSVA 就必须新增一条断言,约束:当复位信号在clk的任意边沿附近释放时,两个版本的状态机都必须在N个周期内进入已知安全状态,且不能进入非法状态。这个N,就是由 STA 报告中两个版本的 reset recovery time 决定的。没有这一步建模,DFT 修改后的 RTL,即使功能仿真全过,也可能在量产测试中暴露致命缺陷。

4.3 第三步:SVA 的“可证性”设计(避免写出形式化工具无法处理的断言)

写 SVA 很容易,但写出能被形式化工具高效证明的 SVA,是另一回事。我们踩过最大的坑,就是用了太多##[1:10]这样的有界延迟,导致验证器搜索空间爆炸,超时失败。EquivSVA 的最佳实践是:

  • 优先使用无界操作符:|->(蕴含)、|=>(强蕴含)、until。它们让工具能进行更智能的状态空间剪枝。
  • 避免在序列中嵌套过多$past:$past($past(signal))会让工具难以展开历史状态。如果必须追溯多周期,用一个辅助的logic [N-1:0] history_reg寄存器来显式保存。
  • 将复杂条件分解为多个简单断言:与其写一个if (a && b && c) |-> (d && e && f),不如拆成p_a_to_d,p_b_to_e,p_c_to_f三条独立断言。工具可以并行验证,失败时也更容易定位根因。
  • 为每个断言添加明确的disable iff:特别是复位条件。disable iff (!rst_n)是标配,但更要考虑disable iff (in_test_mode)这类特殊模式,避免在 DFT 测试时误报。

提示:在编写断言前,务必查阅你所用 EDA 工具的用户手册,了解其对 SVA 子集的支持程度。JasperGold 和 VC Formal 对某些高级特性(如first_match的嵌套)支持度不同。EquivSVA 数据集之所以可靠,正是因为它的每一条断言,都经过了至少三种主流工具的交叉验证。

4.4 第四步:反例驱动的“契约精炼”(用失败的证明来修正你的理解)

形式化验证最迷人的地方,就是它从不撒谎。当你运行 EquivSVA 断言,工具返回一个counterexample(反例)时,不要沮丧,这是你离真相最近的时刻。这个反例,是一个精确的输入向量序列,加上初始状态,它清晰地展示了:在什么情况下,你的两个 RTL 实现,行为开始分叉。

我们曾在一个 PCIe PHY 的等价验证中,收到一个反例:在link_up信号从高变低的瞬间,新版本 PHY 的tx_idle信号比旧版本早一个周期拉高。乍看是小问题,但深入分析发现,这暴露了新版本在 link down 状态机中,对tx_clock停止的检测逻辑存在竞态。旧版本依赖一个额外的同步器,新版本为了节省面积删掉了它。这个反例,直接指导了 RTL 的修复——不是去“调参数”,而是去补上那个被删掉的同步器。

因此,“反例”不是验证的终点,而是契约精炼的起点。你需要:

  1. 用波形查看器(如 Verdi)加载反例,逐周期观察两个 RTL 的内部信号;
  2. 判断这个差异,是设计意图的偏差(需要改 RTL),还是断言本身过于严苛(需要放宽契约);
  3. 如果是前者,修复 RTL 后重新验证;如果是后者,回到第一步,重新审视你的“原子化”契约,看是否过度约束了设计的自由度。

这个过程,会反复进行 3-5 轮,直到所有断言都被证明,且反例都指向真实的 RTL 缺陷。这才是 EquivSVA 的价值闭环:它强迫你把对“等价性”的模糊认知,锤炼成一条条冰冷、精确、可执行的逻辑规则。

5. EquivSVA 在真实项目中的落地陷阱与避坑指南

理论再完美,落地时也会撞墙。我们在将 EquivSVA 方法论推广到整个验证团队时,总结出了五个高频、致命、但极易被忽视的落地陷阱。这些不是教科书里的“注意事项”,而是我们用加班费和 tape-out 延期换来的血泪教训。

5.1 陷阱一:“断言复用”陷阱——把别人的 EquivSVA 直接拷贝到你的项目里

EquivSVA 数据集是公开的,里面有很多通用模块(如 FIFO、AXI Interconnect)的断言。但直接拷贝,90% 的概率会失败。原因很简单:等价性是相对的,不是绝对的。同一个 FIFO,如果你的项目要求它支持“背靠背写入”(即连续两个 write 之间没有间隔),而 EquivSVA 数据集里的断言是基于“写入间隔 >=1 cycle”的假设编写的,那么直接使用,就会在你的设计上产生大量误报(false positive)。

我们的解决方案是:永远把 EquivSVA 当作“模板”,而不是“成品”。拿到一个现成的断言文件,第一件事不是 run,而是做三件事:

  • 查看它的README.md,确认其适用的协议版本(如 AXI4 vs AXI5)、时序约束(如tAW最小值)、以及明确列出的“不支持场景”(如不支持 burst length > 16);
  • 用grep -r "$rose" *.sv扫描所有断言,确认它使用的触发事件($rose,$fell,$stable)是否与你 RTL 中信号的活跃边沿一致(有些设计用高电平有效,有些用上升沿有效);
  • 在你的 testbench 中,构造一个最简的、能触发该断言的场景,手动跑一次仿真,观察断言的assertion failure是否真的对应一个你认可的设计缺陷。

注意:我们团队立下铁规——任何外部引入的 EquivSVA 断言,在正式加入 regression 前,必须由两名工程师独立 review,并签署一份《断言适用性确认单》。这张单子,比代码本身更重要。

5.2 陷阱二:“时钟域”陷阱——在多时钟域设计中,忘了bind的作用域

SystemVerilog 的bind语法非常强大,但也非常“诚实”。它只会将断言绑定到当前作用域内可见的模块实例。在一个复杂的、跨时钟域的 SoC 中,你很容易犯一个低级错误:在顶层 testbench 中bind了一个跨时钟域的 FIFO,但这个 FIFO 的rd_clk和wr_clk是由不同的 PLL 生成的,而你的断言代码里,只声明了一个@(posedge clk)。结果就是:断言只在wr_clk域下被采样,对rd_clk域下的行为完全无感。

正确的做法是:为每个时钟域,编写独立的断言模块,并用bind分别绑定。例如:

// equiv_sva_fifo_wr.sv —— 专管写时钟域 module equiv_sva_fifo_wr ( input logic wr_clk, input logic rst_wr_n, input logic wr_en, input logic [7:0] wr_data, output logic full ); property p_wr_full_after_write; @(posedge wr_clk) disable iff (!rst_wr_n) (wr_en && !full) |-> ##1 full; endproperty assert property (p_wr_full_after_write) else $error("WR domain: full not asserted after write"); endmodule // equiv_sva_fifo_rd.sv —— 专管读时钟域 module equiv_sva_fifo_rd ( input logic rd_clk, input logic rst_rd_n, input logic rd_en, output logic [7:0] rd_data, output logic empty ); // ... 类似的断言,针对 rd_clk 域 endmodule // 在 testbench 中分别 bind bind uut.fifo_wr equiv_sva_fifo_wr checker_wr (.wr_clk(wr_clk), .rst_wr_n(rst_wr_n), ...); bind uut.fifo_rd equiv_sva_fifo_rd checker_rd (.rd_clk(rd_clk), .rst_rd_n(rst_rd_n), ...);

这个看似繁琐的过程,恰恰是 EquivSVA 能在复杂 SoC 中发挥作用的基石。它强迫你把“跨时钟域交互”这个最棘手的问题,拆解成一个个可验证的、单一时钟域内的行为契约。

5.3 陷阱三:“DFT 模式”陷阱——在 scan test 模式下,断言仍在运行

这是最隐蔽的陷阱。当你的 RTL 插入了 DFT 逻辑(如 scan chain、ATPG controller),并且进入了scan_mode,整个设计的时序和控制逻辑都发生了根本性变化。此时,你为正常功能模式编写的 EquivSVA 断言,如果继续运行,大概率会失败——因为scan_mode下,PSEL、PENABLE等信号的驱动源已经变成了 DFT controller,不再是原来的 Master。

解决方案有两个层级:

  • 预防层:在所有 EquivSVA 断言的disable iff子句中,必须包含scan_mode信号。例如:disable iff (!rst_n || scan_mode)。这是一个硬性规范,任何漏掉的断言,都不允许提交。
  • 隔离层:为 DFT 模式,单独编写一套EquivSVA_DFT断言集。这套断言不验证功能等价,而是验证 DFT 逻辑本身的行为:比如scan_in信号在scan_enable为高时,必须被正确移入 scan chain;scan_out信号在scan_capture为高时,必须反映当前 latch 的值。这套断言,同样需要形式化验证,确保 DFT 插入没有引入新的时序或逻辑错误。

我们曾有一个项目,因为漏掉了scan_mode的disable iff,导致在 DFT regression 中,EquivSVA 断言持续报错,浪费了三天时间排查“RTL bug”,最后发现只是断言在错误的模式下运行。从此,scan_mode成了我们所有断言模板里的“保留字段”。

5.4 陷阱四:“工具链”陷阱——形式化验证工具的 license 和配置不匹配

EquivSVA 的威力,高度依赖于后端形式化验证工具的能力。但现实是,JasperGold 和 VC Formal 的 license 模块是分开购买的,Formal App(应用包)和Formal Pro(专业包)的功能天差地别。一个常见的坑是:你的 EquivSVA 断言里用到了induction(归纳法)引擎来证明循环性质,但你的 license 只买了Formal App,不支持induction。结果就是,验证器会静默地降级到bounded model checking,然后超时失败,你却不知道原因。

我们的应对策略是:

  • 建立“工具能力矩阵”:在项目启动时,就和 CAD 团队一起,明确列出本次项目所需的 EquivSVA 断言类型(如:是否需要induction?是否需要multi-threaded并行验证?是否需要UVM-FV接口?),然后据此申请对应的 license。
  • 在 CI/CD pipeline 中,加入 tool capability check:每次 regression 运行前,先执行一个脚本,检查当前 license 是否支持本次 job 所需的所有引擎。如果不支持,立即 fail,并给出明确的 error message:“Missing license for 'induction' engine. Please contact CAD team.” 这个脚本,比任何文档都管用。
  • 永远用-debug模式跑一次小规模验证:在正式 run full chip 之前,先用-debug参数跑一个最小 testcase,观察 log 中的Engine Used: ...字段,确认工具真的在用你期望的那个引擎。

5.5 陷阱五:“文化”陷阱——把 EquivSVA 当成验证工程师的“私活”,而非设计工程师的“必修课”

这是最深层、也最难解决的陷阱。EquivSVA 的成功,70% 取决于技术,30% 取决于流程和文化。如果设计工程师(Design Engineer)认为:“我的 RTL 功能正确,仿真过了,剩下的验证是验证工程师的事”,那么 EquivSVA 就永远停留在“事后检验”的层面,无法发挥其“设计契约”的前置价值。

我们的破局之道,是推行“EquivSVA as Design Spec”文化:

  • 在 RTL 设计阶段,设计工程师就必须提交一份《EquivSVA Interface Contract》,其中包含他承诺的、所有关键接口信号的行为契约(用自然语言+时序图);
  • 这份 Contract,就是后续 EquivSVA 断言开发的唯一输入源,也是 design review 的核心议题;
  • 在 code review 时,除了看 RTL 代码,还必须看对应的 EquivSVA 断言是否已更新,是否覆盖了新引入的路径;
  • 最重要的是,EquivSVA 的通过,是 RTL sign-off 的硬性门槛之一,和 functional coverage、timing closure 并列。

当 EquivSVA 从“验证的终点”,变成“设计的起点”,它才真正拥有了改变芯片质量的力量。这个转变,比任何技术细节都重要。

6. 从 EquivSVA 到下一代验证范式:行为契约驱动的协同设计

EquivSVA 的意义,远不止于一套断言集。它代表了一种正在兴起的、更本质的芯片设计范式:Behavior-Driven Design(行为驱动设计)。在这个范式里,模块的接口不再是一张静态的信号列表,而是一份动态的、可执行的、可验证的行为契约(Behavioral Contract)。

想象一下未来的 SoC 开发流程:

  • IP 提供商交付的,不再仅仅是 RTL 和文档,而是一个.sva包,里面包含了经过形式化验证的 EquivSVA 断言,以及一个contract.json文件,用机器可读的格式(如 OpenAPI Spec)描述了所有契约的语义、前提条件、后置条件;
  • SoC 集成工程师拿到这个包,用一个自动化脚本,就能将断言bind到自己的集成环境中,并一键启动形式化验证;
  • 当他想替换一个老 IP 时,只需要确保新 IP 的 EquivSVA 断言,与旧 IP 的断言集完全兼容——这比跑几百万个 test case 更快、更可靠;
  • 甚至,前端架构师可以用 EquivSVA 的契约,作为 HLS(High-Level Synthesis)工具的输入约束,让工具在生成 RTL 时,就“内建”了行为等价性。

这听起来很远,但其实已经在路上。你提到的“systemverilog队列”,就是一个绝佳的例子。SystemVerilog 的queue类型,天然支持push_front,pop_back,size()等操作,这些操作的语义是明确定义的。一个基于queue实现的 FIFO,其行为契约(如size() == 0当且仅当empty为真)就可以被精确地形式化。这比用一堆reg和always块手写的 FIFO,更容易被 EquivSVA 捕捉和验证。

我个人在实际使用中发现,最有效的 EquivSVA 实践,不是把它当成一个“验证工具”,而是当成一个设计沟通的语言。当设计工程师和验证工程师坐在一起,讨论“这个信号在复位释放后第几个周期必须稳定”时,他们不再争论“我觉得应该是这样”,而是打开 EquivSVA 断言文件,指着p_reset_release_stability这条 property,说:“看,这里定义了##[1:3] $stable(signal),所以我们约定,它必须在 1 到 3 个周期内稳定。” 这种基于代码的、无歧义的沟通,消除了 90% 的理解偏差。

所以,EquivSVA 的终极价值,不在于它能帮你 catch 几个 bug,而在于它迫使整个团队,用一种更精确、更数学化、更协作的方式来思考“什么是正确”。当你的设计文档,本身就是一段可执行、可验证的代码时,芯片的质量,就从“尽力而为”,变成了“必然如此”。

版权声明: 本文来自互联网用户投稿,该文观点仅代表作者本人,不代表本站立场。本站仅提供信息存储空间服务,不拥有所有权,不承担相关法律责任。如若内容造成侵权/违法违规/事实不符,请联系邮箱:809451989@qq.com进行投诉反馈,一经查实,立即删除!
网站建设 2026/10/17 15:31:13

CMW100 K06选件综合测试仪:射频产线测试从部署到自动化的完整实践

做射频产线或研发验证的工程师,十有八九都遇到过一个尴尬局面:选型时对比了一堆参数,觉得哪台都行,真到量产拉通的时候,才发现软件选件授权不齐、链路损耗没校准、自动化脚本调不通,整个进度卡在仪表上。罗…

作者头像 李华
网站建设 2026/10/17 15:30:29

RK3588S硬件设计四大翻车点与信号完整性实战指南

简介:本资源是瑞芯微官方发布的RK3588S高性能多媒体应用处理器硬件设计权威指南,面向硬件开发工程师、PCB Layout工程师及系统测试与技术支持人员,聚焦电源管理、高速接口设计、热仿真优化与EMI/ESD防护等关键工程难点,助力快速构…

作者头像 李华
网站建设 2026/10/17 15:28:28

基于知识图谱与向量检索的智慧政策问答系统全链路拆解

简介:这份资源围绕智慧政策系统的整体设计与落地展开,面向政府信息化从业者、政策研究人员、企业决策者以及关注NLP与知识图谱应用的开发者,帮助解决政策文本处理繁琐、信息孤岛严重、政企政策匹配效率低等问题。内容涵盖文件智能解析、政策垂…

作者头像 李华
网站建设 2026/10/17 15:28:21

低空经济AI算法实战:从感知避障到多机协同的完整技术栈

低空经济这个概念这两年确实火得一塌糊涂,但你可能也发现了,市面上聊政策、聊空域、聊场景的文章一大堆,真正把技术底座——尤其是 AI 算法——讲透的却少之又少。低空经济的“腾飞”不是靠概念吹起来的,靠的是无人机、eVTOL 这些…

作者头像 李华
网站建设 2026/10/17 15:25:58

前端签名参数逆向实战:定位Acs-Token与ab_sr生成链路

1. 先搞清楚这两个参数到底在防什么1.1 抓包看到的第一印象接到“目标系统”这个接口安全评估任务的时候,我第一个动作和大多数做前端安全的人一样:打开抓包工具,先跑一遍核心业务链路,看请求长什么样。结果没跑几步就看到每个请求…

作者头像 李华