news 2026/10/31 5:15:05

FPGA实现8比特图像比特平面分层的硬件设计要点

作者头像

张小明

前端开发工程师

1.2k 24
文章封面图
FPGA实现8比特图像比特平面分层的硬件设计要点

1. 为什么8比特图像的比特平面分层必须在FPGA上做,而不是直接用MATLAB仿真完事?

很多人第一次接触“比特平面分层”这个概念时,第一反应是打开MATLAB,读一张uint8图像,用bitget()逐位提取,再用imshow()把8个平面挨个显示出来——三分钟搞定,看起来很美。我当年也是这么干的,还顺手写了篇博客叫《MATLAB轻松实现图像比特平面分解》,发出去收获不少点赞。但直到某次参与一个实时红外图像预处理模块的联调,我才真正意识到:MATLAB里跑通的算法,和能在FPGA上稳定运行的硬件逻辑,根本不是一回事。

问题出在“实时性”和“资源映射”这两个硬约束上。举个具体例子:假设你处理的是640×480@30fps的灰度视频流,每秒要处理921,600个像素点。每个像素8比特,意味着每秒要完成7,372,800次独立的位提取操作。MATLAB在PC上靠CPU+内存+缓存机制完成这个任务,延迟以毫秒计,且允许短暂卡顿;而FPGA要求每个像素从进入流水线到输出全部8个平面信号,必须在严格固定的时钟周期内完成——比如系统主频100MHz,即每个时钟周期10ns,你得把整个分解逻辑压缩进几个时钟周期内,不能有分支跳转、不能有动态内存分配、不能依赖浮点运算单元。

更关键的是,MATLAB中一个bitget(img, n)调用背后,是完整的软件栈:操作系统调度、内存页管理、函数调用开销、类型自动转换……这些在FPGA里全不存在。FPGA没有“函数”,只有组合逻辑与触发器;没有“数组”,只有寄存器组与RAM块;没有“循环”,只有状态机或并行展开的硬件通路。所以当你在MATLAB里写for k = 1:8, plane{k} = bitget(I, k); end时,你其实在隐式地要求硬件为每个k值构建一套独立的位选择电路,并让它们同时工作——这恰恰是FPGA最擅长的并行模式。

提示:很多初学者误以为“MATLAB能算出来,FPGA照着写Verilog就行”,结果综合后发现LUT用量爆炸、时序违例严重。根本原因在于没做比特级数据流建模——你得把每个像素看作一个8位宽的并行总线,而不是一个待解包的数值。

我后来在某高校图像处理实验室协助搭建一个嵌入式显微镜图像增强系统时,就踩过这个坑。最初用MATLAB生成测试向量,再用ModelSim做功能仿真,一切正常;但烧录到Xilinx Artix-7开发板后,图像出现规律性错位。查了三天才发现:MATLAB默认按列优先(column-major)存储矩阵,而FPGA图像采集IP核输出的是行优先(row-major)的AXI-Stream数据流,中间少了一个转置逻辑。这种细节,MATLAB脚本里不会报错,但硬件上就是黑屏。

所以本项目标题里强调“基于FPGA的8比特图像”,不是为了凑关键词,而是划清一条技术分界线:这是面向硬件实现的比特平面工程,不是算法验证的MATLAB练习。接下来所有内容,都围绕如何把“概念上的8个平面”转化为“物理上可布线、可时序收敛、可与上下游IP互联”的硬件模块展开。

2. 比特平面分层的本质:不是图像处理,而是位域路由与并行广播

先破除一个常见误解:比特平面分层常被归类为“图像增强预处理技术”,好像它的目的是为了后续做图像压缩或隐藏水印。其实不然。在FPGA实时系统中,它的核心价值是实现像素级位域的精细化控制权移交。说得直白点:它是一个“位路由器”,把输入的一个8位宽数据通道,无损地拆成8条独立的1位宽通道,每条通道承载原像素的某一位信息,并保证所有通道严格同步。

我们来拆解这个过程的硬件语义:

  • 输入信号:pixel_in [7:0]—— 标准AXI-Stream协议下的TLAST有效时,该总线携带当前像素的完整8比特值;
  • 输出信号:plane_0,plane_1, ...,plane_7—— 8个独立的std_logic信号,每个对应原像素的bit0~bit7;
  • 关键约束:plane_n必须与pixel_in在同一个时钟沿采样,且传播延迟差异(skew)需控制在±50ps以内,否则下游模块(如阈值比较器、异或加密单元)会因采样时刻不一致而误判。

这就引出了FPGA实现中最容易被忽视的一环:位宽解复用(Demux by Bit Width)。很多人直接写:

assign plane_0 = pixel_in[0]; assign plane_1 = pixel_in[1]; ...

语法没错,但综合工具可能将这8个赋值映射到不同位置的LUT,导致布线长度差异大、时序难以收敛。更鲁棒的做法是强制使用同一SLICE内的多个LUT6,利用其内置的多路复用能力。例如在Xilinx器件中,一个LUT6可配置为两个独立的LUT5,或一个6输入LUT加一个进位链——我们可以把pixel_in[0:3]的提取放在一个SLICE,[4:7]放在相邻SLICE,并通过(* KEEP = "TRUE" *)属性锁定位置。

另一个深层问题是时钟域交叉(CDC)风险。实际系统中,图像传感器输出的像素时钟(如25MHz)往往与FPGA主系统时钟(如100MHz)不同源。如果直接把pixel_in接入本地时钟域做位拆分,会在跨时钟域采样时引入亚稳态。正确做法是:先用两级触发器对pixel_in进行同步化(synchronizer),再在本地时钟域内做位提取。这里有个实操技巧:同步器的输入应是pixel_in的最高位(MSB)或一个专用的pixel_valid信号,而不是整个8位总线——因为8位并行同步需要8个独立同步链,资源浪费且增加布线复杂度。我们通常只同步1位控制信号,再用它使能本地时钟域内的锁存器捕获完整pixel_in。

注意:不要试图在FPGA里“模拟MATLAB的矩阵操作”。比如有人想用Block RAM存一帧图像再做全局比特平面提取,这完全违背实时流处理原则。FPGA的优势在于单像素流水线处理——每个像素进来,8个平面信号立刻就绪,无需等待整帧缓存。这才是“基于FPGA”的题中之义。

我曾帮某工业检测设备厂商优化一个缺陷识别模块,他们原来的方案是用ARM处理器跑OpenCV做比特平面分析,处理一帧要120ms;改用FPGA纯硬件流水线后,降到3.2ms,且功耗从8W降至1.3W。差距在哪?就在于ARM要先把整帧图像DMA到内存,再逐行扫描、位运算、存回;而FPGA是像素流过即处理,像自来水经过分水阀一样自然分流。

3. 从MATLAB脚本到FPGA RTL:比特平面模块的四层结构化设计

把MATLAB里几行代码变成可综合、可验证、可复用的FPGA模块,不能简单翻译语法,而要按硬件思维重构为四层清晰结构。我在多个图像处理SoC项目中验证过这套分层法,它能显著降低调试难度,也方便后续扩展(比如加入动态位平面选择或加权融合)。

3.1 第一层:接口适配层(AXI-Stream to Pixel Bus)

这是与外部世界握手的边界。MATLAB里imread()返回的是一个内存矩阵,而FPGA面对的是标准AXI-Stream协议的数据流。我们必须定义明确的握手信号:

  • s_axis_tvalid:主设备(如图像采集IP)声明数据有效;
  • s_axis_tready:本模块声明已准备好接收;
  • s_axis_tdata [7:0]:8比特像素值;
  • s_axis_tlast:标识当前像素是否为行末/帧末。

关键设计点在于反压机制(backpressure)。很多初学者忽略tready信号,直接把tvalid拉高,结果上游IP因无法发送数据而卡死。正确做法是:当内部流水线未满时,tready置高;一旦缓冲区接近阈值(如深度达80%),立即将tready拉低,迫使上游暂停发送。这个缓冲区不需要大容量RAM,一个2~4深度的FIFO即可,用Xilinx的axi_data_fifoIP核可一键生成。

3.2 第二层:位域解析层(Bit-Field Parsing Pipeline)

这是核心计算层,也是最容易出时序问题的地方。我们不采用单周期全并行提取(虽快但资源贵),而是设计一个2级流水线:

  • Stage 1(采样锁存):在rising_edge(clk)时,用tvalid && tready作为使能,将tdata锁入一个8位寄存器pixel_reg;
  • Stage 2(位分解广播):在下一个时钟沿,将pixel_reg[0]~pixel_reg[7]分别赋给8个输出端口。

为什么用2级而非1级?因为1级意味着组合逻辑必须在单周期内完成采样+锁存+位拆分,对时序要求过于苛刻;2级则把采样和拆分分离,第一级专注建立时间(setup time)满足,第二级专注保持时间(hold time)满足,综合工具更容易布局布线。实测在Artix-7上,2级流水线比1级节省37%的LUT资源,时序余量(slack)提升2.1ns。

3.3 第三层:平面使能控制层(Per-Plane Enable Logic)

标题中“可比特平面分层”的“可”字,意味着必须支持动态选择哪些平面参与输出。比如某些场景只需bit0~bit3(低4位,反映图像纹理细节),bit4~bit7(高4位,反映整体亮度)则屏蔽。这就需要添加一个4位控制寄存器plane_en [3:0],每位对应一个平面组:

  • plane_en[0]控制plane_0~plane_1
  • plane_en[1]控制plane_2~plane_3
  • plane_en[2]控制plane_4~plane_5
  • plane_en[3]控制plane_6~plane_7

注意:控制信号必须同步到像素时钟域!我们用APB总线挂载一个配置寄存器,通过apb_paddr译码后,用像素时钟对apb_pwdata打两拍,再更新plane_en。这样避免APB总线异步写入导致的亚稳态。

3.4 第四层:输出驱动层(Output Synchronization & Fanout)

8个1位输出信号,看似简单,实则暗藏玄机。FPGA IO Bank有驱动能力限制,若直接驱动长走线或多个负载,边沿会变缓,影响下游模块采样。因此必须:

  • 对每个plane_n添加ODDR(Output Double Data Rate)原语,强制在时钟上升沿输出稳定电平;
  • 在顶层约束文件(XDC)中为每个输出添加set_output_delay -max 1.5 -clock clk [get_ports {plane_*}],告诉综合工具最大允许延迟;
  • 若需驱动多个下游模块(如同时送至阈值单元和直方图统计模块),用BUFGCE全局时钟缓冲器复制时钟,确保所有扇出路径时钟相位一致。

这套四层结构,在某医疗内窥镜项目中经受了考验:客户要求支持1080p@60fps下8平面全开启,同时预留bit7单独用于曝光控制信号。我们仅修改第四层的输出驱动配置,就完成了无缝升级,未改动前三层任何逻辑。

4. 验证闭环:如何用MATLAB生成黄金参考,驱动FPGA功能仿真与板级测试

既然FPGA实现不能依赖MATLAB运行,那MATLAB的价值在哪里?答案是:作为黄金参考模型(Golden Reference Model),生成确定性测试向量与预期输出。这是硬件验证的基石,也是避免“仿真通过、上板失败”的关键防线。

4.1 黄金向量生成:从图像到确定性比特流

我们不用真实照片,而用可控的合成图像。MATLAB脚本如下:

% 生成测试图像:左半屏为递增灰度,右半屏为棋盘格 img = uint8(zeros(480, 640)); for i = 1:480 img(i, 1:320) = uint8((i-1)*2); % 每行亮度+2 end for i = 1:480 for j = 1:320 if mod(i,16)==0 && mod(j,16)==0 img(i, 320+j) = 255; else img(i, 320+j) = 0; end end end % 提取各比特平面(MATLAB方式) planes_matlab = cell(1,8); for k = 1:8 planes_matlab{k} = bitget(img, k); % 返回logical矩阵 end % 写入二进制测试向量文件(供ModelSim读取) fid = fopen('test_vectors.bin', 'w'); for i = 1:480 for j = 1:640 fwrite(fid, img(i,j), 'uint8'); % 按行写入原始像素 end end fclose(fid); % 写入黄金输出文件(8个平面,每个平面存为1-bit packed binary) for k = 1:8 plane_bin = zeros(1, 480*640, 'uint8'); idx = 1; for i = 1:480 for j = 1:640 plane_bin(idx) = uint8(planes_matlab{k}(i,j)); idx = idx + 1; end end filename = sprintf('golden_plane_%d.bin', k); fid = fopen(filename, 'w'); fwrite(fid, plane_bin, 'uint8'); fclose(fid); end

这段脚本生成的test_vectors.bin是FPGA仿真时的输入激励,而8个golden_plane_*.bin是ModelSim仿真的预期输出。关键点在于:所有数据都是确定性的、可复现的、与硬件无关的。哪怕换一台电脑、重装MATLAB,只要脚本不变,生成的二进制文件就完全一致。

4.2 ModelSim功能仿真:用TCL脚本自动化比对

在ModelSim中,我们编写TCL脚本自动加载测试向量、运行仿真、比对结果:

# load_test.do vlog -work work bitplane_top.v vsim -c -novopt work.bitplane_top do wave.do # 加载输入向量 mem load -infile test_vectors.bin /tb/dut/pixel_in # 运行足够长的仿真时间(覆盖整帧) run 100000 ns # 导出8个平面输出到文件 mem save -o plane_0_out.bin /tb/dut/plane_0 mem save -o plane_1_out.bin /tb/dut/plane_1 ... # 调用MATLAB比对脚本(或用Python脚本) exec matlab -batch "compare_outputs" quit -f

比对脚本compare_outputs.m会读取plane_0_out.bin与golden_plane_0.bin,逐字节比较,输出差异位置。这样就把验证从“人眼观察波形”升级为“机器自动判定”,错误定位精确到第几行第几列像素。

4.3 板级测试:用ILA核抓取真实信号流

仿真通过只是第一步,板级测试才是终极考场。我们在FPGA设计中嵌入Xilinx的ILA(Integrated Logic Analyzer)核,探针连接到pixel_in和8个plane_*信号。测试时:

  • 用摄像头采集一张已知图案(如ISO12233测试卡);
  • 触发ILA捕获连续1000个像素的pixel_in与plane_0~plane_7;
  • 将ILA导出的CSV文件导入MATLAB,用相同bitget()逻辑生成黄金参考;
  • 编写脚本自动比对ILA实测值与MATLAB参考值。

有一次,ILA抓到plane_3在特定像素位置恒为0,而MATLAB参考是1。排查发现:该位置对应图像传感器的VSYNC信号干扰,耦合到了数据线上。我们在PCB上为pixel_in走线增加了包地处理,并在FPGA输入端添加RC滤波,问题解决。这个细节,纯仿真永远发现不了。

提示:板级测试务必用真实传感器数据,而非函数发生器模拟。因为传感器的时序抖动(jitter)、电源噪声、线缆反射都会在真实环境中暴露硬件设计的脆弱点。

5. 实战避坑指南:那些文档里不会写的FPGA比特平面设计陷阱

以下是我过去五年在十多个图像处理项目中踩过的坑,有些花了整整一周才定位,现在整理出来,帮你绕过这些“静默杀手”。

5.1 陷阱一:未处理像素时钟的占空比失真(Duty Cycle Distortion)

图像传感器输出的像素时钟(PCLK)理想是50%占空比,但实际可能为40%~60%。当这个时钟直接作为FPGA内部逻辑的驱动时,会导致:

  • 奇数周期采样点偏移,造成pixel_in建立时间不足;
  • 综合工具误判时序路径,报告虚假的时序违例。

解决方案:绝不直接用PCLK驱动核心逻辑。必须先经过IDELAYE2原语(Xilinx)或类似延迟单元,用DELAY_SRC="IDATAIN"模式校准,再送入PLL倍频。PLL输出的本地时钟(如100MHz)必须用CLKOUT_PHASE参数精确设置相位,使采样沿落在PCLK高电平的中点位置。实测表明,相位偏移±5°就会导致单帧内出现3~5个错位像素。

5.2 陷阱二:AXI-Stream的TLAST信号与时序竞争

TLAST标识行尾/帧尾,但它的有效沿可能与TVALID不同步。若在always @(posedge clk) if (tvalid && tlast)中直接采样,会因组合逻辑延迟导致漏判。正确做法是:用tlast的上升沿触发一个单脉冲(pulse generator),该脉冲宽度严格为1个时钟周期,再用它锁存当前pixel_in作为行末像素。脉冲生成代码必须用同步复位:

reg tlast_sync1, tlast_sync2; always @(posedge clk or posedge rst) begin if (rst) begin tlast_sync1 <= 1'b0; tlast_sync2 <= 1'b0; end else begin tlast_sync1 <= tlast; tlast_sync2 <= tlast_sync1; end end wire tlast_pulse = ~tlast_sync2 & tlast_sync1; // 上升沿检测

5.3 陷阱三:位平面输出的IO标准不匹配

很多开发者把plane_0~plane_7配置为LVCMOS33,但下游模块(如ADC驱动芯片)要求LVDS电平。强行连接会导致:

  • 信号边沿缓慢,下游无法识别逻辑电平;
  • 长期工作引发IO Bank过热。

解决方案:在XDC约束文件中,为每个plane_*端口明确指定IO标准:

set_property IOSTANDARD LVCMOS18 [get_ports {plane_0}] set_property IOSTANDARD LVDS_25 [get_ports {plane_1}] ...

并确保所选Bank支持该标准。Xilinx Vivado的I/O Planning视图会直观标红不兼容的配置。

5.4 陷阱四:未考虑温度漂移对时序的影响

FPGA在-40°C~100°C工作时,硅片延时变化可达±15%。仿真时用Slow-125C工艺角跑通,不代表高温下仍稳定。必须做三温角仿真(Typical, Slow, Fast),尤其关注pixel_in到plane_0这条关键路径。我曾在一个车载项目中,常温下测试完美,-40°C冷启动时plane_7出现毛刺,根源是某段组合逻辑在低温下延时缩短,导致与寄存器建立时间冲突。最终在路径上插入BUFHCE缓冲器,人为增加可控延时,解决问题。

这些坑,没有十年实战经验很难系统总结。它们不写在Xilinx UG903手册里,也不在MATLAB Help中,但却是FPGA工程师每天直面的真实战场。

6. 扩展思考:比特平面分层只是起点,真正的价值在于构建位域可编程图像流水线

做到“8比特图像可比特平面分层”,只是踏入FPGA图像处理的第一道门槛。它的真正价值,是为你打开一扇门:构建一个像素级位域可编程的图像处理流水线。这意味着,你可以把传统上由CPU串行执行的复杂操作,分解为多个并行的1位逻辑单元,用硬件原语高效实现。

举几个已落地的扩展方向:

6.1 方向一:位平面加权融合(Bit-Weighted Fusion)

不是简单显示8个平面,而是对不同平面赋予不同权重后融合。例如在低光照增强中:

  • bit7(最高位)权重=128,代表基础亮度;
  • bit4~bit6权重=8~64,代表中频细节;
  • bit0~bit3权重=1~8,代表高频噪声。

用FPGA实现就是8个乘法器(可用DSP48E1原语)并行工作,再加一个8输入加法树。整个过程在3个时钟周期内完成,吞吐率远超ARM。某安防摄像头项目用此方案,将弱光下车牌识别率从68%提升至92%。

6.2 方向二:动态位平面掩码(Dynamic Bitmasking)

根据图像内容自适应启用/屏蔽某些位平面。例如:

  • 计算当前行像素的方差(用plane_7做粗略亮度判断);
  • 若方差<10,说明是均匀背景,启用plane_0~plane_2做精细边缘检测;
  • 若方差>50,说明是复杂前景,启用plane_5~plane_7做主体分割。

这需要在FPGA中集成一个微型状态机,实时统计行级特征。我们用Block RAM做双口缓存,一个口写入新像素,一个口读取前一行数据做差分,资源开销仅增加12%。

6.3 方向三:比特平面到事件相机的映射(Event-Based Mapping)

受生物视觉启发,把每个比特平面的变化(从0→1或1→0)视为一个“事件”。当plane_k在连续两帧间翻转时,生成一个(x,y,k,t)事件包。这正是事件相机(Event Camera)的核心原理。我们用FPGA实现了全硬件事件生成器,延迟低于500ns,比软件方案快三个数量级。

所以,当你在Vivado里成功综合出第一个比特平面模块时,别急着庆祝。请记住:你编写的不是8个布尔信号,而是8条通往像素级智能处理的高速公路入口。MATLAB教会你“是什么”,而FPGA告诉你“怎么让它在物理世界里可靠地跑起来”。这条路没有捷径,但每一步扎实的布线、每一次成功的时序收敛、每一个被你亲手修复的亚稳态,都在重塑你对数字世界的理解深度。

最后分享一个小技巧:每次综合后,务必打开Vivado的Report Utilization,重点关注Slice LUTs中Logic与Memory的占比。如果Memory占比超过30%,说明你可能过度依赖RAM做缓存,应回头审视是否能用更高效的流水线或状态机替代——这才是FPGA工程师的日常修行。

版权声明: 本文来自互联网用户投稿,该文观点仅代表作者本人,不代表本站立场。本站仅提供信息存储空间服务,不拥有所有权,不承担相关法律责任。如若内容造成侵权/违法违规/事实不符,请联系邮箱:809451989@qq.com进行投诉反馈,一经查实,立即删除!
网站建设 2026/10/31 5:14:56

医疗科研智能化生物样本库管理系统设计与实践

1. 医疗科研智能化生物样本库管理系统概述在医疗科研领域&#xff0c;生物样本库作为基础研究的重要资源平台&#xff0c;其管理水平直接影响着科研数据的可靠性和研究效率。传统样本库管理普遍存在样本信息记录不完整、流转过程不透明、存储环境监控滞后等问题。我们团队开发的…

作者头像 李华
网站建设 2026/10/31 5:11:03

动态规划解股票买卖问题:状态转移与空间优化

1. 动态规划解股票问题的核心思路股票买卖问题作为动态规划经典题型&#xff0c;其核心在于状态定义和状态转移。面对含冷冻期、手续费等复杂条件时&#xff0c;我们需要更精细地划分状态。以309题为例&#xff0c;我将状态划分为四类&#xff1a;状态0&#xff1a;持有股票&am…

作者头像 李华
网站建设 2026/10/31 5:09:22

大空间吊顶空调选型与ZX2机组核心技术解析

1. 大空间吊顶空调选型要点解析在商业建筑、厂房、体育馆等大空间场所&#xff0c;传统的壁挂式或柜式空调往往难以满足均匀送风的需求。吊顶式空调射流机组凭借其独特的气流组织方式&#xff0c;成为这类场所的首选方案。ZX2型吊顶式空调射流机组作为行业主流产品&#xff0c;…

作者头像 李华
网站建设 2026/10/31 5:08:17

把技能当项目管:刻意练习、量化评估与技能树的复利系统

说实话&#xff0c;最近几年我越来越烦“skills”这个词被滥用。简历上写“熟练使用Python”的人&#xff0c;可能连一份完整的数据清洗文档都写不出来&#xff1b;朋友圈到处转发“终身学习”&#xff0c;但真正把一项能力练到能交付的人寥寥无几。原因不是大家不努力&#xf…

作者头像 李华
网站建设 2026/10/31 5:08:02

技能习得的底层逻辑:从知道到做到,掌握刻意练习的实战框架

我见过太多人把“学技能”活成了“收藏技能”&#xff1a;网盘里躺着几十个教程&#xff0c;收藏夹里堆满了干货文章&#xff0c;付费课程买了好几门&#xff0c;打卡群加了七八个&#xff0c;三个月后回头一看&#xff0c;好像什么都会一点&#xff0c;又什么都不会。说真的&a…

作者头像 李华