news 2026/11/4 5:38:58

AXI总线协议核心机制:五通道握手、突发与乱序

作者头像

张小明

前端开发工程师

1.2k 24
文章封面图
AXI总线协议核心机制:五通道握手、突发与乱序

简介:《AXI总线协议规范》面向数字IC、FPGA与SoC设计学习者,围绕ARM AMBA 3.0中的AXI高性能、高带宽、低延迟片内总线展开,帮助读者理解五通道结构、分离地址与数据相位、突发传输、乱序响应及低功耗握手等核心机制。资源包共1个doc文档,约77KB,内容偏向协议要点梳理与概念讲解,适合作为总线协议入门、工程查阅和面试复习的参考资料。文档结合AXI的诞生背景、性能优势、通道定义、与AHB的对比及典型应用场景进行说明,并对低功耗控制接口中CACTIVE、CSYSREQ、CSYSACK的握手过程作了展开,便于读者把抽象协议放到SoC互连设计中理解。目前已有430人学习下载,适合需要系统梳理AXI基础并查漏补缺的初、中级读者。

1. 一份 AXI 总线协议规范真正值钱的地方,不在时序图

很多人第一次翻 AXI 总线协议规范,注意力都停在时序图上:VALID 什么时候拉高、READY 什么时候回、T2 到 T3 中间隔几个周期。但真正让 AXI 从一堆片上总线里立住的,是一个反直觉的决定:它没有去抠「单次传输能多快」,而是把「等待」(一次传输从发出到收尾的整段时间)从协议里拆了出去。地址通道发完不必等数据回来,写地址和写数据各走各的路,不同归属的事务回来顺序可以打乱。这些设计单看都不惊艳,合在一起才解释了为什么多核系统里最堵的那条通路能被疏通。吃透这套机制,你再看任何一份 AXI 总线协议规范的接口描述,就能分清哪些是硬约束、哪些只是实现习惯。

2. 五通道与 VALID/READY:单向通道凭什么把延时压下来

2.1 共享总线的死结:一个慢设备拖垮全局

先看被替代的那套结构。AHB 是典型的共享总线:某一时刻只有一个主设备拿到授权,地址相位和数据相位复用同一组线,HREADY 是一个横跨整个系统、被所有主从设备共同观察的信号。只要有一个从设备慢,把 HREADY 拉低,整条总线上的所有主设备就一起等。这在单核时代还能忍,到了多核加多级存储的结构里,短板效应会让平均带宽被最慢的那条访问路径锁死。

AXI 的做法是把这条大总线切成五条点对点的通道:写地址 AW、写数据 W、写响应 B、读地址 AR、读数据 R。每条通道有自己独立的 VALID/READY 握手信号,互不阻塞。写数据堵住了不影响读地址发出去,读数据回来了也不占用写通道的线。这不是简单地把线拆细,而是把「谁能等谁」这层依赖关系从物理连线上解开了。

单向通道的收益不止于逻辑清晰。每个通道方向固定,综合时不需要三态门和方向切换逻辑,扇出可以按各自负载单独优化;跨时钟域时,只需要处理一个方向的异步 FIFO,不必在双向握手上做协议转换。原文说「简化时钟域间的桥接,减少门数量」,说的就是这层物理实现上的收益,而不是抽象层面的优雅。

2.2 VALID/READY 的两条硬规则:为什么必须有一方先动

五通道共用一个握手模型,但模型本身只有两条硬规则:发起方不允许等对方的 READY 拉起来之后才置 VALID;VALID 一旦置起,必须保持到握手完成那一拍才能撤销。这两条是防死锁的根:如果双方都等对方先动,链路会永久锁死;如果 VALID 可以随时反悔,接收方就无法判断某一拍到底算不算一次有效传输。

常见的实现写法是这样,注意 VALID 的置位与 READY 完全无关:

// 源端:VALID 置位不依赖 READY,撤销只能发生在握手沿 always @(posedge aclk or negedge aresetn) begin if (!aresetn) begin awvalid <= 1'b0; end else if (awvalid && awready) begin awvalid <= 1'b0; // 握手完成才允许撤销,这是规则二 end else if (aw_req_pending) begin awvalid <= 1'b1; // 请求一产生就置起,不看 awready,这是规则一 end end // 目的端:READY 只反映自身缓冲余量,不去组合依赖 VALID 再反过来影响 VALID assign rready = ~fifo_full;

第一段代码里,awvalid的下一拍取值只由「请求是否产生」和「本次是否已握手」决定,与awready的高低完全没有因果关系。这就是规则一的落地形态。第二段把rready写成缓冲余量的纯函数,是为了避免valid -> ready -> valid形成组合环:一旦成环,综合工具只能报组合逻辑环路,仿真则会表现为某个时刻所有通道同时停住,也就是常说的挂死。

awready和rready这类信号允许滞后于 VALID,这正是反压的物理含义:接收方通过延迟应答,把压力反向传导给发送方,而发送方唯一的应对方式是「保持住,不撤回」。这套约定让两端可以各自按自己的节奏做流水优化,代价是每一端都必须维护一份未完成事务的记录。

2.3 寄存器切片:通道分离让时序收敛变成一件可分段的事

「容易做时序收敛」这句话经常被当成套话,它其实有非常具体的物理含义。当总线要跨过一片很大的芯片版图时,长线延迟会吃掉一个时钟周期的大部分余量。AHB 那种复用线加全局 HREADY 的结构,一旦插入寄存器就会改变协议时序关系,需要重新验证。AXI 的每条通道是独立握手,可以单独在中间插一级寄存器切片,只要保证这条通道内部的顺序不变即可。

寄存器切片的实现核心是一个 skid buffer:正常情况下数据直通,延迟一拍;当输出端的 READY 突然拉低时,把当拍数据存进备份寄存器,输入端仍然可以再收一拍,从而不损失吞吐。插入切片只增加固定延迟,不降低稳态带宽,关键就在于每条通道可以独立做这件事:数据通道插两级、地址通道插一级,两条通道的延迟差异由 outstanding 机制吸收,不会破坏语义。

提示:插切片的前提是这条通道内部严格保序。如果在切片里做了任何重排,同 ID 事务的顺序保证就会被破坏,而这种错误往往在小流量测试里看不出来。

3. 突发与 outstanding:一笔地址换十六拍数据的赌注

3.1 AxLEN、AxSIZE、AxBURST 三个字段如何决定地址序列

突发传输是 AXI 省掉地址开销的核心手段。一笔传输只在地址通道上给一次首地址,后面每一拍的地址由从设备根据三个字段自己推算:AxLEN是拍数减一,AxSIZE是每拍字节数的以 2 为底的对数,AxBURST决定地址怎么走。FIXED表示地址不动,适合反复读写同一个寄存器;INCR表示每拍递增;WRAP表示递增到块边界后回绕。

算一笔账就明白这笔赌注有多大。64 位数据总线、AxSIZE=3(8 字节)、AxLEN=15(16 拍),一次突发搬 128 字节。地址通道上只走了一次地址加控制。如果按每拍一次地址来算,地址通道要跑 16 次同样宽度的传输。也就是说,突发把地址通道的占用压到了原来的十六分之一,这在地址位宽和数据位宽接近的总线里是非常可观的节省。

从设备侧推算地址的常见写法大致如下:

// 从设备根据突发类型推算每拍地址,beat_cnt 从 0 开始 always @(*) begin case (axburst) 2'b00: cur_addr = axaddr; // FIXED:地址恒定 2'b01: cur_addr = axaddr + (beat_cnt << axsize); // INCR:每拍加 2^AxSIZE 2'b10: cur_addr = wrap_base(axaddr, axlen, axsize) + ((beat_cnt << axsize) & wrap_mask(axlen, axsize)); // WRAP:块内回绕 default: cur_addr = axaddr; endcase end

beat_cnt << axsize等价于「拍序号乘以每拍字节数」,左移代替乘法是因为axsize本身就是指数。WRAP 的块大小等于(axlen+1) << axsize,回绕就是把地址对块大小取模再加上块基址。举个具体例子:AxLEN=3(4 拍)、AxSIZE=2(4 字节),块大小 16 字节,起始地址0x08,地址序列是0x08、0x0C、0x00、0x04。这个回绕行为是缓存行填充的刚需,写错一位就会出现数据搬到错误行上的诡异现象。

3.2 非对齐与窄传输:WSTRB 到底在屏蔽什么

AXI 支持非对齐访问,代价是首拍要做字节屏蔽。假设 64 位总线、AxSIZE=3(8 字节)、起始地址0x03,那么首拍只有地址0x03到0x07这五个字节有效,对应的WSTRB是 bit3 到 bit7 置位,低三位清零。WSTRB[n]与WDATA[8n+7:8n]一一对应,这是唯一的映射约定,记错方向就会把数据写到相邻字节上,而且这种错误在整字节对齐的测试里完全测不出来。

窄传输是另一个高频误区:当AxSIZE表示的每拍字节数小于总线宽度时,数据不是永远贴着最低字节道摆放,而是按地址对齐到对应的字节道上,并随地址递增在总线内部「旋转」。也就是说,同样是 2 字节有效数据,地址0x00时落在WDATA[15:0],地址0x02时落在WDATA[23:8]。这套行为的目的是让窄传输和宽传输共享同一套地址译码逻辑,但从设备如果只接低 16 位数据线,就必须自己做移位对齐。

3.3 outstanding:把等待藏进流水线

outstanding 指的是「已经发出但还没收到响应」的事务。主设备在没拿到上一笔读数据的情况下,可以继续发下一笔读地址,这就是 outstanding 操作。它解决的问题很具体:一次访问的总延迟由「协议开销 + 从设备处理时间 + 返回路径」构成,如果每笔都必须等完整往返才能发下一笔,吞吐上限就是 1/延迟。

假设从设备处理一笔读需要 10 个周期,不做 outstanding 时吞吐是每 10 周期一笔;允许 4 笔在途,且从设备的控制通路可以流水,稳态吞吐接近每 10 周期 4 笔。这里的关键前提是从设备的控制通路真的能流水,如果从设备内部只是一个串行状态机,outstanding 只会让请求在入口排队,深度配得再大也不会变快,反而增加缓冲面积。这就是为什么配置 outstanding 深度时必须看对端实际能接收多少,而不是往大了配。

4. 乱序与低功耗:ID 决定数据归属,CACTIVE 决定时钟归属

4.1 AxID 是排序域编号,不是事务编号

一旦允许多笔事务同时在途,就必须回答一个问题:读数据回来时,怎么知道它属于哪一笔请求。AXI 的答案是给每笔事务打上AxID,响应通道上用RID和BID带回同一个值。规则只有一句:相同 ID 的传输必须保序,不同 ID 之间可以乱序。

这句话把 ID 的本质说清楚了:它是一个排序域的编号,不是流水号。同一个 ID 内部,响应必须按请求发出的顺序返回,主设备可以简单地按序接收;不同 ID 之间没有顺序约束,快的从设备不必等慢的从设备,一条路径的拥塞不会辐射到其他路径。如果按流水号理解 ID、给每笔事务分配一个新号,那你等于宣布所有事务都在不同域里,从设备可以任意乱序返回,主设备侧的接收逻辑会立刻崩溃。

4.2 重排缓冲:乱序回来的数据怎么拼回去

主设备侧要按 ID 维护重排逻辑。每个 ID 域记录一个「下一个期望序号」,收到乱序的包先缓存,等缺口补齐后连续吐出。用一个最小的模型说明机制:

class ReorderBuffer: def __init__(self): self.next_seq = {} # 每个 ID 域的下一个期望序号 self.pending = {} # 已到达但前序缺口未补的包 def accept(self, tid, seq, data): expect = self.next_seq.get(tid, 0) if seq == expect: # 正好是期望的那一笔 self.deliver(tid, data) self.next_seq[tid] = expect + 1 self._drain(tid) # 尝试把缓存中连续的包放出来 else: self.pending.setdefault(tid, {})[seq] = data # 乱序,先压着 def _drain(self, tid): buf = self.pending.get(tid, {}) while self.next_seq[tid] in buf: self.deliver(tid, buf.pop(self.next_seq[tid])) self.next_seq[tid] += 1

next_seq是每个域的期望指针,pending是乱序缓存,_drain在缺口补上的瞬间把后续连续的包一次性吐出。这段逻辑对应到硬件就是每个 ID 一份小队列加一个完成计数。它揭示了一个成本关系:乱序带来的收益越大(并发域越多),主设备侧要维护的队列就越多,面积随 ID 数量线性增长。

4.3 ID 位宽与映射:集成时最容易被低估的成本

ID 位宽不是越大越好。位宽决定了排序域的数量,也决定了主设备侧重排表的项数和从设备侧按 ID 分队列的缓冲深度。一个经验做法是让 ID 宽度匹配实际并发事务数,而不是取接口允许的最大值。多出来的位不会提升任何性能,只会让每个跨接模块都多带一份状态。

更麻烦的是集成时的 ID 映射。当上游主设备的 ID 位宽大于下游从设备支持的位宽时,必须做映射,而截断高位是最糟的一种做法:两个不同主设备的事务可能被映射到同一个 ID,被从设备当成同一个排序域处理,响应就会串台。正确做法是保留高位或者加前缀位,保证不同来源的 ID 在收窄后仍然互不冲突。这类问题往往要跑很长时间、在特定并发组合下才暴露,排查成本极高。

4.4 CACTIVE 与 CSYSREQ:谁有权关时钟

低功耗接口是 AXI 在数据传输协议之外的一层扩展,它要解决的是「什么时候可以安全地停掉一个模块的时钟」。这套接口只有三个关键信号:设备输出的CACTIVE表示自己还需要时钟;系统输出的CSYSREQ表示请求进入低功耗;设备输出的CSYSACK表示状态迁移完成。

给设备否决权是这套设计的核心。设备内部可能正处在不可中断的状态里,比如正在完成一次写操作或者正在做内部刷新,系统侧看不到这些状态,只有设备自己知道。于是协议把「我现在能不能停」的判断权交给了掌握信息的一方,而不是交给离得远的调度方。

时序上,正常状态CSYSREQ和CSYSACK都为高。T1 时刻系统拉低CSYSREQ发起请求;T2 时刻设备拉低CSYSACK,表示已经进入低功耗状态;T3 时刻系统拉高CSYSREQ请求退出;T4 时刻设备拉高CSYSACK,表示已经退出。全程CACTIVE保持高电平时,表示设备不接受这次低功耗请求,此时CSYSACK不跟随变化,系统必须继续供时钟。这里有个容易读错的点:CSYSACK只表示状态迁移的完整性,不表示「同意进入低功耗」,真正的许可由CACTIVE表达。

设备侧状态机的骨架大致是这样:

localparam NORMAL = 2'b00, ENTERING = 2'b01, LOWPWR = 2'b10, LEAVING = 2'b11; always @(posedge aclk or negedge aresetn) begin if (!aresetn) begin state <= NORMAL; csysack <= 1'b1; end else case (state) NORMAL: if (!csysreq && !cactive) begin // CACTIVE 参与进入条件 csysack <= 1'b0; state <= ENTERING; end ENTERING: if (!csysreq) state <= LOWPWR; // 迁移完成,等待退出请求 LOWPWR: if (csysreq) begin // 退出必须无条件响应 csysack <= 1'b1; state <= LEAVING; end LEAVING: state <= NORMAL; endcase end

注意cactive只出现在进入条件里,不出现在退出条件里。设备一旦收到退出请求,必须立刻恢复时钟并响应,不允许再用CACTIVE拖延,否则系统侧会一直等一个不会到来的应答。这种「进入可以拒绝、退出不能拒绝」的非对称规则,是低功耗握手能收敛的前提。

系统层面有两种策略:轮询式由系统周期性检查各设备的CACTIVE,发现可以停就发起请求,实现简单但精度受扫描周期限制,且耦合较强;事件式由设备主动拉低CACTIVE通知系统,效率更高,但系统需要预留唤醒路径,还要防止刚停就用的抖动。两种方式可以混用,通常对可预测的外设用轮询,对空闲不可预测的模块用事件式。

5. 避坑与排查:五个在现场反复出现的翻车点

5.1 握手与复位:三个让仿真挂死的写法

现象:仿真跑到某一时刻,所有通道的 VALID 都不动,波形上既没有握手也没有报错,日志停在最后一个事务上。

原因:VALID 被写成了组合逻辑,并且依赖 READY,例如assign wvalid = wready && has_data。当 READY 因为下游缓冲满而拉低,VALID 也跟着掉,上游认为传输取消,下游却已经把这一拍当成有效数据传输,两边状态机错位,最终互相等待。另一种变体是 VALID 在未握手时被上层逻辑撤销。

解决:VALID 一律寄存器输出,置位条件只看「本端是否有请求」,撤销条件只看「本拍是否握手成功」。把这条规则写成代码评审的硬性检查项,比事后看波形便宜得多。

现象:上电后第一笔传输偶发丢失,复位释放后重新跑又正常。

原因:复位只清了数据通路,没清 VALID 这类控制信号,或者用了异步复位但释放没有做同步,导致不同触发器在不同周期退出复位。第一笔事务就在这个窗口里被吃掉了。

解决:所有 VALID 类信号纳入复位域,异步置位、同步释放。复位释放后先跑一段空转周期再发真实事务,把窗口期错开。

现象:仿真里 READY 一直是高,综合后上板却出现吞吐骤降。

原因:仿真激励把rready恒置为 1,掩盖了反压路径从未被验证过的事实。真实从设备在缓冲满时会拉低 READY,而主设备侧的 skid buffer 或者重排逻辑没有正确实现「保持 VALID、缓存数据」,于是丢包。

解决:在验证环境里强制注入随机反压,让 READY 以一定概率拉低,覆盖连续反压和单拍反压两种模式。这条经验属于典型的血泪教训,凡是没被反压过的握手逻辑,默认认为它有 bug。

5.2 突发与 ID:两个跑长了才暴露的问题

现象:单笔小数据传输全部正确,一旦换成 16 拍突发,从设备就挂住不动,或者多收了一拍。

原因:AxLEN是「拍数减一」,被当成拍数用了,导致从设备少等一拍WLAST;或者窄传输下地址按总线宽度递增而不是按AxSIZE递增,拍数与实际字节数对不上,WLAST在错误的位置出现。

解决:所有拍数计算统一用AxLEN+1;地址递增一律用1 << AxSIZE,不要用数据总线宽度。写一个只跑突发的定向用例,把AxLEN从 0 到最大值、AxSIZE从 0 到总线宽度全部扫一遍。

现象:系统跑几分钟后出现读数据错位,错位的数据内容本身是对的,只是出现在了错误的事务上。

原因:两个并发线程复用了同一个AxID,但从设备把它们的响应归到了同一个排序域。由于同 ID 必须保序,从设备按序返回,主设备却按线程各自接收,结果数据被投递给了错误的一方。

解决:ID 与线程绑定,一个线程一个域;如果线程数超过 ID 可表达的范围,就要在线程入口做串行化。更隐蔽的版本是集成时 ID 位宽被截断,两个来源的 ID 收窄后撞在一起,这类问题必须靠 ID 映射表加断言来防,不能靠肉眼核对。

注意:ID 冲突导致的错误不会在单事务测试里出现,只有在并发深度足够、两个来源同时有在途事务时才会显现,测试用例必须故意制造这种并发。

6. 设计取舍:AXI 的复杂度该花在哪里

五通道、outstanding、乱序、低功耗接口,每一项都要换面积和验证成本。真正需要判断的是:这次设计里,哪一项的收益能覆盖它的代价。

维度共享总线式结构五通道结构
面积线少、缓冲少每通道独立缓冲与握手逻辑,面积随通道数增长
吞吐受最慢从设备拖累通道间互不阻塞,慢路径不辐射全局
延迟仲裁加复用,路径短但排队久单次延迟略高,靠 outstanding 摊薄
时序收敛全局信号难打断可分段插寄存器切片
验证成本状态空间小乱序、反压、低功耗握手组合爆炸

从这张表能看出一条清晰的取舍线:如果目标系统只有一个主设备、访问模式规整、对面积极度敏感,五通道带来的并发能力大部分用不上,复杂度就是纯负担;反过来,一旦有多个主设备、有 DMA 与处理器同时访问不同从设备,通道间不阻塞和 ID 分域带来的收益会迅速超过面积代价。

配置参数上也是同样的逻辑。outstanding 深度配到对端缓冲的两倍以上,多出来的部分只会让请求在入口排队;ID 位宽按接口上限取,多出的位不会提升并发,只会让每个跨接模块多带一份状态;寄存器切片的级数按物理距离定,多插一级就多一拍延迟,对延迟敏感的路径要单独评估。

从那以后我每次拿到一份新的总线接口描述,都强制自己先做一遍「哪些等待是必须的、哪些只是实现习惯」的拆解,再决定要不要开 outstanding、要不要拆 ID 域。这个习惯帮我避开了好几次「性能不够就加深度」的盲目优化。希望帮到你。

本文还有配套的精品资源,点击获取

版权声明: 本文来自互联网用户投稿,该文观点仅代表作者本人,不代表本站立场。本站仅提供信息存储空间服务,不拥有所有权,不承担相关法律责任。如若内容造成侵权/违法违规/事实不符,请联系邮箱:809451989@qq.com进行投诉反馈,一经查实,立即删除!
网站建设 2026/11/4 5:38:44

分布式存储系统架构设计与性能优化实战

1. 分布式存储系统在大数据时代的核心价值十年前我第一次接触TB级数据处理时&#xff0c;服务器频繁崩溃的场景至今记忆犹新。传统单机存储就像试图用家用冰箱存放整个超市的货物&#xff0c;而分布式存储则像把货物智能分配到多个仓库的网络。当前企业数据量每年增长约40%&…

作者头像 李华
网站建设 2026/11/4 5:38:35

足球数据API实战:从选型到应用开发全指南

1. 足球数据API的价值与应用场景现代足球产业早已进入数据驱动时代。从职业俱乐部的球探系统到体育媒体的实时报道&#xff0c;从菠菜公司的赔率计算到球迷自建的战术分析平台&#xff0c;高质量的比赛数据已成为核心生产资料。我接触过不少业余开发者想搭建足球数据分析项目&a…

作者头像 李华
网站建设 2026/11/4 5:38:35

Java方法重载的核心原理与最佳实践

1. 方法重载的本质与价值在Java编程中&#xff0c;方法重载&#xff08;Overload&#xff09;是一个看似简单却极其重要的概念。作为Java开发者&#xff0c;我经常看到新手在理解这个概念时容易陷入误区。让我用一个真实的开发场景来说明它的重要性&#xff1a;假设你正在开发一…

作者头像 李华
网站建设 2026/11/4 5:37:29

分布式系统幂等性设计与.NET实战

## 1. 异步请求中的幂等性危机&#xff1a;你可能正在重复造轮子上周排查一个线上订单重复支付问题时&#xff0c;发现某个.NET服务接口在10秒内被同一个客户端连续调用了7次。更可怕的是——由于缺乏幂等性处理&#xff0c;这7次调用全部执行成功&#xff0c;直接导致用户被重…

作者头像 李华
网站建设 2026/11/4 5:36:57

三步搞定PDF离线保存:类型判断、获取路径与本地书库整理

电子书资源的离线管理一直是很多重度阅读者的刚需&#xff0c;尤其是那些习惯在通勤路上、飞行模式下或者网络不稳定的环境里啃完一本几百页PDF的人。我自己就有过这样的经历&#xff1a;在某个文档分享平台上找到了一份绝版的行业报告&#xff0c;页面加载慢得让人抓狂&#x…

作者头像 李华
网站建设 2026/11/4 5:36:53

Oracle数据字典命中率:性能优化与实战解析

1. 数据字典命中率&#xff1a;Oracle数据库性能的关键指标作为一名Oracle DBA&#xff0c;我每天都会检查数据库的各项性能指标&#xff0c;其中数据字典命中率是最容易被忽视却又至关重要的一个。这个看似简单的百分比数字&#xff0c;实际上直接影响着数据库的解析效率和整体…

作者头像 李华