news 2026/11/4 10:36:43

AXI总线协议详解:五通道、握手时序与SoC互连实践

作者头像

张小明

前端开发工程师

1.2k 24
文章封面图
AXI总线协议详解:五通道、握手时序与SoC互连实践

简介:《AXI总线协议规范》是一份面向SoC、FPGA与芯片设计学习者及工程师的协议学习文档,聚焦AMBA 3.0中AXI高性能、高带宽、低延迟片内总线的核心机制,帮助读者梳理通道结构、突发传输、乱序响应、握手时序与低功耗设计等关键概念。压缩包内共1个doc文件,约77KB,内容以协议定义、性能特点、与AHB对比及典型应用为主线,适合作为入门查阅、课程学习与项目设计参考。已有430人学习下载,说明其在总线协议学习场景中具有一定参考价值。文档围绕读地址、读数据、写地址、写数据、写响应五个独立通道展开,并涉及非对齐传输、outstanding操作、out-of-order访问以及CACTIVE、CSYSREQ、CSYSACK低功耗握手,便于读者建立从基础定义到SoC互联设计的知识框架,也可用于面试复习、技术选型与模块联调前的概念核对。

1. 到底什么是 AXI:芯片内部的一条高架快速路

想象一座城市,所有货物都要在两个片区之间来回运送。如果只有一条双向单车道,送货车、回收车、调度指令全挤在上面,谁也快不了。芯片内部是同样的道理:处理器、存储器、DMA 控制器、各种外设 IP 之间要不停搬数据,如果它们共用一条"谁都能占、谁都得等"的通道,性能很快就会卡死。AXI(Advanced eXtensible Interface)就是为解决这件事而设计的一套片内总线协议规范,它属于 AMBA 3.0 框架里最重要的组成部分,面向高性能、高带宽、低延迟的片上通信,规定了芯片里各个模块之间怎么打招呼、怎么发地址、怎么搬数据、怎么确认收货。

搞懂它的价值在于:只要你在看 SoC 架构图、芯片手册或者 IP 接口文档,AXI 几乎一定会跳出来。它不是一个抽象名词,而是一套把"通道怎么分、握手怎么走、顺序怎么排"都写死了的规则。规则定得越清楚,集成时踩坑越少。

2. 为什么会有 AXI:SoC 复杂到一定程度,总线就成了瓶颈

2.1 一颗芯片里,"路"是怎么变成堵点的

早期的芯片规模小,几个模块连一条总线就够了:处理器发一个请求,存储器回一个数据,中间没有太多人抢。可当一颗芯片里塞进多个处理器核、多级存储器结构、DMA 控制器和一堆外设之后,情况就变了。每一方都想发请求,每一方都在等回应,总线从"够用的路"变成了"全芯片最窄的那个关口"。

这种瓶颈在多处理器设计里尤其明显。多个核同时要读内存,如果总线同一时刻只允许一笔交易在走,其余核只能排队。排队本身不致命,致命的是排队期间那些核的其他工作也只能停着等。数据中心里讲究"别让最快的工人等最慢的环节",芯片内部也是同一个逻辑:总线结构选得好不好,直接决定整颗芯片能跑多快,而它偏偏还要兼顾成本、功耗和面积,这三者之间很难同时满足。

选总线结构之所以困难,是因为它不像换个电阻那样局部可调。总线一改,所有挂在上面的 IP 接口都得跟着改,前后端设计、验证、时序收敛全部重来。所以当 SoC 的复杂度跨过某个门槛之后,继续在旧结构上打补丁就不划算了,需要一次真正意义上的换代。

2.2 老一代总线 AHB 的局限:一根 hready 卡住所有人

要理解 AXI 为什么长这样,得先看它的上一代——AHB。AHB 是 AMBA 2.0 时代的产物,在它所属的年代足够好用,但结构上有几个绕不开的限制。

第一个限制是"共用一套地址和数据节拍"。AHB 的地址阶段和数据阶段绑在一起推进,一笔传输没走完,下一笔的地址很难提前发出去。这就好比快递员必须先把你这一单送到、签收完,才能去取下一单的包裹,中间的空档全浪费了。

第二个限制是握手信号的形态。AHB 用的是单向的 hready 信号来表达"我这边准备好了",从设备只能被动配合。一旦某个慢速从设备把 hready 拉住,整条总线上的传输节奏都会被拖下来。对于挂了一堆速度参差不齐外设的系统来说,这种"一个人慢,全车人等"的机制代价很高。

第三个限制是读和写共用通路。读写不能同时推进,数据流向要么朝这边、要么朝那边,物理上就得照顾两个方向的时序,时钟频率往上提的时候,双向走线的时序收敛也更难做。

这些限制在单核、少外设的年代问题不大,可到了多核、多级存储、DMA 并行的场景,就变成了实打实的天花板。

2.3 AMBA 3.0 的选择:不是修路,是重画交通规则

面对这些天花板,AMBA 3.0 给出的答案不是把旧路拓宽,而是重新设计交通规则——这就是 AXI。它的思路可以概括成一句话:与其让所有人挤在一条双向道上互相谦让,不如把不同方向的车流彻底分开,各走各的道,谁也别等谁。

AXI 把地址、读数据、写数据、握手信号分别放进不同的通道里传输,信息流只以单方向流动。单方向带来的好处很实在:不用再为一个通道同时优化两个方向的时序,时钟域之间的桥接变简单了,门电路数量也降下来了,信号穿过复杂的片上系统时延迟更短。这三个收益——时序好收敛、面积更小、延迟更低——恰好是 SoC 设计里最看重的几项。

同时,AXI 把突发传输做成了"只给首地址"的模式:一次传输一串数据,主设备只需要告诉从设备从哪儿开始、传多长,后面的地址由协议自己推算。再加上主设备在没拿到返回数据之前就可以继续发多个读写操作,整条链路的流水线就能真正跑起来。这些设计不是凭空想出来的花样,每一条都对应着上一代总线的一个具体痛点。

3. AXI 的五条通道是怎么分工的

3.1 读地址、读数据、写地址、写数据、写响应

AXI 最直观的特征是"五通道"结构,具体分成:读地址和控制通道、读数据通道、写地址和控制通道、写数据通道、写响应通道。理解这套划分,最省力的方式是把它拆成两组业务:读业务和写业务。

读业务需要两条通道。主设备先把"我要读哪个地址、读多少"放进读地址通道;从设备准备好数据后,通过读数据通道把数据送回来。写业务需要三条通道:主设备先把写地址和控制信息放进写地址通道,再把要写的数据放进写数据通道,从设备收完之后,通过写响应通道回一个确认,告诉主设备这笔写到底成没成。

这里有个容易被忽略的细节:写操作为什么比读操作多一条通道?因为写是"我先把东西给你",主设备需要知道对方到底收没收到、收得对不对,所以要有一个独立的响应通道来回路。读操作本身就是在等对方给数据,数据的到达天然就带着"收到了"的意味,不必再单开一条确认通道。分开之后,每个通道只负责一件事,接口逻辑简单,时序也更容易做干净。

3.2 valid 与 ready:每笔交易都要双方点头

五条通道虽然各走各的,但每一条通道内部的节奏是靠一对握手信号控制的:valid 和 ready。valid 由发起方拉高,意思是"我这边数据/地址已经摆好了,有效";ready 由接收方拉高,意思是"我这边腾出手了,可以接"。

只有当 valid 和 ready 在同一拍同时为高,这笔传输才算真正发生。这个规则看似简单,威力在于它把"快"和"慢"解耦了:快的一方拉高 valid 之后不需要撤回来干等,慢的一方什么时候 ready 什么时候接,双方都不必迁就对方的固定节拍。慢速外设再慢,也只影响它自己那笔交易,不会像单向 hready 那样把整条总线的节奏拖住。

提示:valid 一旦拉高就必须保持到握手完成,中间不能因为对方没 ready 就撤掉。这是初学者写接口时最容易翻车的地方之一,撤了就等于告诉对方"刚才那笔不算",而对方可能已经采样了。

3.3 last 与 burst:一次握手搬一整串

如果每一拍数据都要重新发一次地址,那总线的时间就全花在发地址上了。AXI 的应对办法是突发传输(burst):主设备在地址通道里给出首地址和这次要传的数据量,之后的每一拍数据都沿着这个起始点顺推,不再重复发地址。

为了标记这一串什么时候结束,数据通道里带了一个 last 信号。传输到最后一拍时把它拉高,接收方就知道"这单货齐了"。这个信号的用处不只是计数,它让接收方可以提前判断什么时候能收尾、什么时候能释放缓冲区,对流水线设计很关键。

突发带来的吞吐提升是实打实的。同样搬一批数据,逐笔传输要经历 N 次"发地址—等数据"的往返,突发传输只需要一次地址往返,剩下全是连续的数据拍。并行执行的突发操作越多,单位时间内完成的任务就越多,而总线的空转时间越少,功耗自然也跟着降下来——这部分是 AXI 能同时做到高性能和低功耗的底层原因之一。

3.4 ID 字段:多笔交易同时在路上怎么认领

通道分开、允许不等回话就继续发请求,随之而来一个新问题:如果主设备一口气发了好几笔读请求,从设备返回数据的顺序未必和请求顺序一致,主设备怎么知道哪份数据属于哪笔请求?

答案是用 ID 标识。每一笔访问都带着自己的归属标识,从设备回数据时把这个标识一起带回来,主设备据此把数据和请求对上号。同一个 ID 的访问必须保持顺序,不同 ID 的访问才可以打乱——这就把"能不能乱"的决定权交给了发起方:你要是怕乱,就全用同一个 ID;你要是想榨性能,就给不同业务分配不同 ID,让它们各走各的。

这个机制的本质,是把"顺序"从总线的硬性约束变成了可配置的选项。旧式总线不管你有没有并行需求,一律按顺序来;AXI 让你自己决定哪些访问需要保序、哪些可以放开。灵活性的代价是设计者要想清楚 ID 怎么分配,分配得乱,回数据时就容易对不上号。

4. AXI 的性能与低功耗是怎么做出来的

4.1 地址与数据相位分离带来的流水线

AXI 把地址/控制相位和数据相位彻底分开,这个决定带来的是流水线化的可能。主设备发完地址就可以去准备下一笔的地址,不必等这笔数据回来;从设备收到地址后可以慢慢准备数据,准备好了再往数据通道上放。两件事在时间上重叠起来,链路的使用率就上去了。

这个特性和"支持未完成传输"是一体两面。主设备在没有得到返回数据的情况下,可以连续发出多个读写操作,这些操作在从设备侧排队、处理、返回,形成一条不断流的流水线。对从设备而言,它的控制流处理可以持续有活干,不会出现"干一下、等三下"的空转。

顺带一个好处是时序收敛更容易。地址和数据分开走,各自只需要优化自己那一路的时序,不用在一个通道里同时兼顾两个方向的建立保持关系。芯片频率往上提的时候,这种"各管各的"结构往往比双向共用结构更容易过关。

4.2 outstanding 与乱序:不等回话就继续下单

用生活场景打个比方:你在餐厅点菜,如果必须等第一道菜上桌才能点第二道,那整顿饭的效率取决于厨房最慢的那道菜。AXI 允许的是"一次性把几道菜都点上",厨房按自己的节奏出菜,先做好的先上桌。这就是未完成传输(outstanding)的意义——请求可以堆在途,不必等回应。

堆在途之后,返回顺序就可能和请求顺序不同,于是有了乱序访问。乱序不是为了乱而乱,它是为了不让慢请求堵住快请求。假如主设备先发了一个访问慢速外设的请求,又发了一个访问高速存储器的请求,严格保序的话后一个必须等前一个,白白浪费时间;允许乱序,快的先回,整体等待时间就短了。

乱序的边界由 ID 划定:同 ID 保序,跨 ID 可乱。这条规则让设计者可以按业务划分"顺序域",既拿到并行收益,又不至于让需要严格先后关系的数据出错。

4.3 非对齐传输:省掉一次拆包

存储器访问通常按字对齐,但实际数据未必总落在对齐边界上。传统做法是拆成两次对齐访问再拼接,多一次往返。AXI 支持非对齐数据传输,一笔访问就能覆盖跨边界的数据,省掉了拆包和重组的麻烦。

非对齐支持的意义不只是省一次传输,它减少了主设备侧的拆分逻辑,也减少了从设备侧的合并逻辑,对面积和延迟都是正向的。当然,非对齐访问对地址计算和字节选通的要求更高,设计时要把边界情况想全,否则很容易出现"数据搬对了、字节位置错了"的隐蔽问题。

4.4 低功耗握手:时钟什么时候能关

AXI 在数据传输协议之外,还定义了一套低功耗控制接口,用来规定进出低功耗模式前后的握手流程:怎么通知设备准备进入低功耗、什么时候可以关时钟、什么时候开回来、怎么退出。这套接口对自带功耗管理能力的设备和没有该能力的设备都通用。

核心是三根信号。CACTIVE 由设备给出,表示"我现在还需要时钟";CSYSREQ 由系统侧给出,表示"我请求你进入低功耗状态";CSYSACK 由设备回给系统,用来对请求做握手确认。系统拉低 CSYSREQ 发起请求,设备拉低 CSYSACK 表示配合,退出时再把两者依次拉高。要注意的是,CSYSACK 只表示状态迁移走完了,设备到底同不同意进低功耗,看的还是 CACTIVE——它可以一直保持高电平来表示"我现在不接受这个请求"。

系统层面有两种管理方式。一种是系统主动轮询,挨个问设备"你现在能歇了吗",能歇就把请求发下去。这种方式实现简单,但效率不高,因为系统并不知道哪个设备其实早就闲了,只能按时间去问,耦合性强。另一种是设备主动通过 CACTIVE 上报"我闲了",系统被动接收后再决定要不要发起请求,效率更高,但如果系统预判马上要用这个设备,也可以选择不发请求。两种方式可以混着用,具体怎么配取决于整颗芯片的功耗策略。

5. 常见误区与易混概念:别把 AXI 和 AHB 混成一回事

5.1 易混一:AXI 是"更快的 AHB"

这是最常见的误解。AXI 常被描述成 AHB 的升级版,于是很多人默认它只是"频率更高、带宽更大",接口思路应该差不多。实际上两者的组织方式根本不同:AHB 更接近一条共享的、读写共用的主干道,AXI 则是五条分工明确的单向通道加一套握手规则。

区分方法很简单:看接口信号的组织形态。如果地址和数据是绑在一起推进的、握手是单向的,那多半是旧一代结构;如果读地址、读数据、写地址、写数据、写响应各自独立,每条通道都有自己的 valid/ready,那就是 AXI 的路子。把 AXI 当"提速版 AHB"去理解,会在通道独立性和乱序处理上接连踩坑。

5.2 易混二:五个通道等于五根线

"五通道"这个说法容易让人以为是五根物理走线,其实每个通道都是一组信号的总称。读地址通道里不只有地址,还有控制信息和 ID;读数据通道里不只有数据,还有响应状态和 last 标志。一个通道动辄十几根甚至几十根线。

区分方式:把"通道"理解成"业务方向"而不是"导线数量"。它划分的是职责,不是物理层。真正做接口连接时,要按每个通道内部的信号清单逐条对接,不能只连地址和数据了事。

5.3 易混三:乱序访问会让数据错位

听到"乱序",第一反应往往是"那数据不就乱套了"。这个担心在 AXI 里其实被 ID 机制挡住了:同一 ID 的访问严格保序,只有不同 ID 之间才允许打乱,而返回的数据会带着 ID 回来,主设备能准确认领。

区分方式:问一句"这些访问的 ID 一样吗"。一样就必须按顺序处理,不一样才可以放开。真正会出问题的是 ID 分配混乱——比如两笔本该有先后的访问被分到了不同 ID,那才可能出现期望之外的交错。

5.4 易混四:非对齐传输等于随意传

支持非对齐,不代表可以无视边界随意发地址。非对齐传输依然有明确的字节选通规则,哪些字节有效、落在哪个边界,都要按协议标清楚。它省掉的是"拆成两次对齐访问"的往返,不是省掉地址计算。

区分方式:看这笔访问的字节选通是否和起始地址、传输长度对得上。对不上就是设计错误,跟协议无关。

5.5 易混五:AXI、AXI4、AXI4-Lite 是一回事

AXI 是一整套总线协议规范的统称,AMBA 3.0 里定下的那一版是它的起点;后续还衍生出了不同配置,比如面向完整高性能场景的版本,以及面向简单寄存器访问的精简版本。精简版通常通道更少、不支持突发,适合挂那些只需要偶尔读写几个寄存器的慢速外设。

区分方式:看这个 IP 需不需要高吞吐和突发。需要就上完整版,只是配几个控制寄存器就用精简版,硬把完整 AXI 套在简单外设上,接口面积和验证成本都不划算。

6. 什么时候该用 AXI,什么时候别硬上

先说适合的场景。第一类是高吞吐数据通路,比如处理器访问存储器、DMA 在内存和外设之间搬大批数据。这类场景对带宽敏感,突发传输和未完成传输能把链路利用率拉满。第二类是多个主设备共享多个从设备的互连结构。AXI 的主从接口是对称的,点对点和多层系统都能用,配合 ID 机制可以让不同主设备的流量并行推进。第三类是有明确功耗管理需求的系统,低功耗握手接口给了 IP 一套统一的进出低功耗流程,集成时不用每家外设各写一套。

再说别硬上的场景。如果只是一个慢速外设,隔很久才被读写一次寄存器,那完整的五通道加突发机制基本用不上,接口面积和验证工作量反而成了负担,精简配置更合适。如果系统里数据流向非常单一、没有并行访问的需求,那 AXI 的乱序和 outstanding 能力也就发挥不出来,选更简单的结构能省下不少时序收敛的功夫。还有一种情况是团队对握手协议不熟,硬上之后 valid 拉高又撤回、last 位置放错、ID 分配重号这类问题会反复出现,调试成本可能超过性能收益。

一个最小的握手片段长这样,看懂了它,五条通道的节奏就都通了:

// 简化的 AXI 写地址通道握手:valid 由主设备发起,ready 由从设备给出 // 只有两者同时为高,这一拍地址才算真正被接收 always @(posedge clk) begin if (!rst_n) begin awvalid <= 1'b0; // 复位后不发起请求 end else if (awvalid && !awready) begin awvalid <= awvalid; // 对方没准备好,保持有效,不能撤回 end else if (awvalid && awready) begin awvalid <= 1'b0; // 握手完成,本笔地址交出去 end end

这段代码里有三个关键点。awvalid 一旦拉高,在 awready 到来之前必须保持,这是握手协议最基本的约束,撤回就等于毁约。awready 由从设备控制,它什么时候拉高取决于自己内部的缓冲和状态,主设备无权干涉。两者同时为高的那一拍叫握手完成,地址正式转移,之后主设备才能考虑发下一笔。同样的结构在五条通道上反复出现,读数据、写数据、写响应都是这个节奏,区别只在于谁发起、谁接收。

注意:写数据通道和写地址通道是分开握手的,两者不必同时发生。从设备可以先收地址后收数据,也可以边收边处理,但写响应必须等数据收完才发。把这三者的先后关系记混,是集成阶段最常见的翻车点。

我第一次对着波形调 AXI 接口的时候,就是栽在"以为地址发出去数据就自动跟着走"上,结果从设备一直在等写数据通道的 valid,主设备却在等写响应,两边僵在那里,波形上看不出任何报错,只有一片安静。后来养成了一个习惯:每接一个 AXI 接口,先把五条通道的握手顺序在纸上画一遍,标清楚谁先谁后、哪个信号必须保持、哪个可以提前,再动手写代码。这个笨办法救过我很多次,也让我明白 AXI 的复杂度不在单条规则,而在五条通道之间的时序关系。希望帮到你。

本文还有配套的精品资源,点击获取

版权声明: 本文来自互联网用户投稿,该文观点仅代表作者本人,不代表本站立场。本站仅提供信息存储空间服务,不拥有所有权,不承担相关法律责任。如若内容造成侵权/违法违规/事实不符,请联系邮箱:809451989@qq.com进行投诉反馈,一经查实,立即删除!
网站建设 2026/11/4 10:36:31

ICGI:基于因果提示型LLM与组学数据的癌症基因识别新方法

1. 项目背景与核心价值 癌症基因识别一直是精准医疗领域的核心挑战。传统方法通常依赖统计相关性分析&#xff0c;但这种方法存在明显的局限性——相关性不等于因果性。ICGI&#xff08;Integrated Causal Gene Identification&#xff09;创新性地将因果提示型大型语言模型与组…

作者头像 李华
网站建设 2026/11/4 10:34:22

SDK游戏盾:端云协同防护机制与性能优化

1. SDK游戏盾的核心防护机制解析游戏行业面临的DDoS攻击规模在2023年已突破Tbps级别&#xff0c;而传统防护方案往往存在延迟高、误杀率高等问题。SDK游戏盾通过客户端嵌入的防护模块与云端清洗中心联动&#xff0c;构建了独特的"端云协同"防护体系。其核心原理是在游…

作者头像 李华
网站建设 2026/11/4 10:33:35

安卓电视虚拟鼠标:遥控器模拟触控的平滑算法与无障碍注入实践

安卓电视的交互困境&#xff0c;几乎每个深度用过电视盒子的人都有一肚子话想说。遥控器的方向键在网格化界面上挪来挪去还算顺手&#xff0c;可一旦碰上那些为手机触屏设计的应用——滑动列表、长按拖拽、双指缩放——方向键立刻变成一根不听话的拐杖&#xff0c;点一下挪一格…

作者头像 李华
网站建设 2026/11/4 10:33:17

VBto Converter V2.89观察:老VB代码迁移的真实边界与分批策略

简介&#xff1a;VBto Converter V2.89 是一款面向仍维护 Visual Basic 6.0 旧项目的开发者与迁移团队的源代码转换工具&#xff0c;可把完整 VB6 工程及源码转为 VC MFC、VC.NET、VB.NET、C#、J#、CBuilder、Delphi 等可继续开发的项目&#xff0c;并支持 VS 2010、Delphi 201…

作者头像 李华
网站建设 2026/11/4 10:33:12

Word论文页眉设置全攻略:奇偶页与分节技巧

1. 论文页眉设置的核心逻辑 在撰写学术论文时&#xff0c;页眉设置是格式规范中最容易出错的部分之一。我处理过上百份学位论文的格式调整&#xff0c;发现90%的页眉问题都源于对"节"和"页"的概念混淆。Word中的"节"是格式独立的最小单位&#x…

作者头像 李华
网站建设 2026/11/4 10:32:46

直流无刷电机AX BY CZ绕组划分:120°电角度而非垂直轴线

前阵子一位朋友发来一张无刷电机端子的照片&#xff0c;问我&#xff1a;资料里写“AX、BY、CZ”&#xff0c;这到底是怎么划分的&#xff1f;是不是像XYZ坐标那样&#xff0c;三根轴互相垂直&#xff1f;我愣了一下&#xff0c;因为这个问题确实比想象中普遍得多——在电机维修…

作者头像 李华